null
SMILES: Cc1ccsc1CCn1c(CC(=O)Nc2ccc(F)cc2)c(O)n(-c2ccc(F)cc2)c1=S
InChI Key: InChIKey=BOJFWENQZXNKGK-UHFFFAOYSA-N
Activity Spreadsheet -- Enzyme Inhibition Constant Data from BindingDB
Found 1 hit for monomerid = 50383085
Trg + Lig
Ki
nM
ΔG°
kcal/mole
IC50
nM
Kd
nM
EC50/IC50
nM
koff
s-1
kon
M-1s-1
pHTemp
°C
Kinesin-like protein KIF11
(Homo sapiens (Human))
BDBM50383085
(CHEMBL2031570)
Show SMILES Cc1ccsc1CCn1c(CC(=O)Nc2ccc(F)cc2)c(O)n(-c2ccc(F)cc2)c1=S
Show InChI InChI=1S/C24H21F2N3O2S2/c1-15-11-13-33-21(15)10-12-28-20(14-22(30)27-18-6-2-16(25)3-7-18)23(31)29(24(28)32)19-8-4-17(26)5-9-19/h2-9,11,13,31H,10,12,14H2,1H3,(H,27,30)
Reactome pathway
n/an/a 600n/an/an/an/an/an/a
Korea Institute of Science and Technology
Curated by ChEMBL
Assay Description
Inhibition of Eg5 ATPase activity by pyruvate kinase/lactate dehydrogenase-linked assay
J Med Chem 55: 2561-73 (2012)
Article DOI: 10.1021/jm201290v
BindingDB Entry DOI: 10.7270/Q2M909P0