BDBM50383192 CHEMBL2032032
SMILES: COc1ccc2c(Oc3ccc(NC(=O)c4c(C)n(CC5CNC(=O)O5)n(-c5ccccc5)c4=O)cc3F)ccnc2c1
InChI Key: InChIKey=JJGHHJJQQHUAGN-UHFFFAOYSA-N
Data: 3 KI  1 IC50
Activity Spreadsheet -- Enzyme Inhibition Constant Data from BindingDB
Found 4 hits for monomerid = 50383192
Trg + Lig
Ki
nM
ΔG°
kcal/mole
IC50
nM
Kd
nM
EC50/IC50
nM
koff
s-1
kon
M-1s-1
pHTemp
°C
Hepatocyte growth factor receptor
(Homo sapiens (Human))
BDBM50383192
(CHEMBL2032032)
Show SMILES COc1ccc2c(Oc3ccc(NC(=O)c4c(C)n(CC5CNC(=O)O5)n(-c5ccccc5)c4=O)cc3F)ccnc2c1
Show InChI InChI=1S/C31H26FN5O6/c1-18-28(30(39)37(20-6-4-3-5-7-20)36(18)17-22-16-34-31(40)42-22)29(38)35-19-8-11-27(24(32)14-19)43-26-12-13-33-25-15-21(41-2)9-10-23(25)26/h3-15,22H,16-17H2,1-2H3,(H,34,40)(H,35,38)
4.40n/an/an/an/an/an/an/an/a
Amgen Inc.
Curated by ChEMBL
Assay Description
Inhibition of c-Met by HTRF assay
J Med Chem 55: 1868-97 (2012)
Article DOI: 10.1021/jm201331s
BindingDB Entry DOI: 10.7270/Q23B616C
Vascular endothelial growth factor receptor 2
(Homo sapiens (Human))
BDBM50383192
(CHEMBL2032032)
Show SMILES COc1ccc2c(Oc3ccc(NC(=O)c4c(C)n(CC5CNC(=O)O5)n(-c5ccccc5)c4=O)cc3F)ccnc2c1
Show InChI InChI=1S/C31H26FN5O6/c1-18-28(30(39)37(20-6-4-3-5-7-20)36(18)17-22-16-34-31(40)42-22)29(38)35-19-8-11-27(24(32)14-19)43-26-12-13-33-25-15-21(41-2)9-10-23(25)26/h3-15,22H,16-17H2,1-2H3,(H,34,40)(H,35,38)
NCI pathway
Reactome pathway
519n/an/an/an/an/an/an/an/a
Amgen Inc.
Curated by ChEMBL
Assay Description
Inhibition of VEGFR2 by HTRF assay
J Med Chem 55: 1868-97 (2012)
Article DOI: 10.1021/jm201331s
BindingDB Entry DOI: 10.7270/Q23B616C
Insulin-like growth factor I receptor
(Homo sapiens (Human))
BDBM50383192
(CHEMBL2032032)
Show SMILES COc1ccc2c(Oc3ccc(NC(=O)c4c(C)n(CC5CNC(=O)O5)n(-c5ccccc5)c4=O)cc3F)ccnc2c1
Show InChI InChI=1S/C31H26FN5O6/c1-18-28(30(39)37(20-6-4-3-5-7-20)36(18)17-22-16-34-31(40)42-22)29(38)35-19-8-11-27(24(32)14-19)43-26-12-13-33-25-15-21(41-2)9-10-23(25)26/h3-15,22H,16-17H2,1-2H3,(H,34,40)(H,35,38)
Reactome pathway
1.66E+3n/an/an/an/an/an/an/an/a
Amgen Inc.
Curated by ChEMBL
Assay Description
Inhibition of IGF1R by HTRF assay
J Med Chem 55: 1868-97 (2012)
Article DOI: 10.1021/jm201331s
BindingDB Entry DOI: 10.7270/Q23B616C
Hepatocyte growth factor receptor
(Homo sapiens (Human))
BDBM50383192
(CHEMBL2032032)
Show SMILES COc1ccc2c(Oc3ccc(NC(=O)c4c(C)n(CC5CNC(=O)O5)n(-c5ccccc5)c4=O)cc3F)ccnc2c1
Show InChI InChI=1S/C31H26FN5O6/c1-18-28(30(39)37(20-6-4-3-5-7-20)36(18)17-22-16-34-31(40)42-22)29(38)35-19-8-11-27(24(32)14-19)43-26-12-13-33-25-15-21(41-2)9-10-23(25)26/h3-15,22H,16-17H2,1-2H3,(H,34,40)(H,35,38)
n/an/a 116n/an/an/an/an/an/a
Amgen Inc.
Curated by ChEMBL
Assay Description
Inhibition of HGF-mediated c-Met autophosphorylation in human PC3 cells after 10 mins by quantitative electrochemiluminescent immunoassay
J Med Chem 55: 1868-97 (2012)
Article DOI: 10.1021/jm201331s
BindingDB Entry DOI: 10.7270/Q23B616C