BDBM50383292 CHEMBL2029438
SMILES: COc1cc(ccc1Nc1ncc2CN(Cc3ccccc3)C(=O)N(c3cccc(NC(=O)C=C)c3)c2n1)N1CCN(C)CC1
InChI Key: InChIKey=JARUUYXHPLGHLF-UHFFFAOYSA-N
Data: 1 IC50  1 Kd
Activity Spreadsheet -- Enzyme Inhibition Constant Data from BindingDB
Found 2 hits for monomerid = 50383292
Trg + Lig
Ki
nM
ΔG°
kcal/mole
IC50
nM
Kd
nM
EC50/IC50
nM
koff
s-1
kon
M-1s-1
pHTemp
°C
Epidermal growth factor receptor
(Homo sapiens (Human))
BDBM50383292
(CHEMBL2029438)
Show SMILES COc1cc(ccc1Nc1ncc2CN(Cc3ccccc3)C(=O)N(c3cccc(NC(=O)C=C)c3)c2n1)N1CCN(C)CC1
Show InChI InChI=1S/C34H36N8O3/c1-4-31(43)36-26-11-8-12-28(19-26)42-32-25(23-41(34(42)44)22-24-9-6-5-7-10-24)21-35-33(38-32)37-29-14-13-27(20-30(29)45-3)40-17-15-39(2)16-18-40/h4-14,19-21H,1,15-18,22-23H2,2-3H3,(H,36,43)(H,35,37,38)
n/an/an/a 1.20n/an/an/an/an/a
Chinese Academy of Sciences
Curated by ChEMBL
Assay Description
Binding affinity to EGFR
J Med Chem 55: 2711-23 (2012)
Article DOI: 10.1021/jm201591k
BindingDB Entry DOI: 10.7270/Q2K938JM
Epidermal growth factor receptor
(Homo sapiens (Human))
BDBM50383292
(CHEMBL2029438)
Show SMILES COc1cc(ccc1Nc1ncc2CN(Cc3ccccc3)C(=O)N(c3cccc(NC(=O)C=C)c3)c2n1)N1CCN(C)CC1
Show InChI InChI=1S/C34H36N8O3/c1-4-31(43)36-26-11-8-12-28(19-26)42-32-25(23-41(34(42)44)22-24-9-6-5-7-10-24)21-35-33(38-32)37-29-14-13-27(20-30(29)45-3)40-17-15-39(2)16-18-40/h4-14,19-21H,1,15-18,22-23H2,2-3H3,(H,36,43)(H,35,37,38)
n/an/a 0.290n/an/an/an/an/an/a
Chinese Academy of Sciences
Curated by ChEMBL
Assay Description
Inhibition of EGFR after 1.5 hr by FRET assay
J Med Chem 55: 2711-23 (2012)
Article DOI: 10.1021/jm201591k
BindingDB Entry DOI: 10.7270/Q2K938JM