BDBM50383551 CHEMBL2032382
SMILES: COc1cc(C)c(cn1)-c1ccc(\C=C\C(=O)NO)c(Cl)c1
InChI Key: InChIKey=FMHZRNRTCFOUKK-AATRIKPKSA-N
Data: 1 IC50
Activity Spreadsheet -- Enzyme Inhibition Constant Data from BindingDB
Found 1 hit for monomerid = 50383551
Trg + Lig
Ki
nM
ΔG°
kcal/mole
IC50
nM
Kd
nM
EC50/IC50
nM
koff
s-1
kon
M-1s-1
pHTemp
°C
Botulinum neurotoxin type A
(Clostridium botulinum)
BDBM50383551
(CHEMBL2032382)
Show SMILES COc1cc(C)c(cn1)-c1ccc(\C=C\C(=O)NO)c(Cl)c1
Show InChI InChI=1S/C16H15ClN2O3/c1-10-7-16(22-2)18-9-13(10)12-4-3-11(14(17)8-12)5-6-15(20)19-21/h3-9,21H,1-2H3,(H,19,20)/b6-5+
NCI pathway
Reactome pathway
n/an/a 750n/an/an/an/an/an/a
Fox Chase Chemical Diversity Center
Curated by ChEMBL
Assay Description
Inhibition of clostridium botulinum Botulinum neurotoxin type A using SNAPide as substrate by FRET analysis
Bioorg Med Chem Lett 22: 3754-7 (2012)
Article DOI: 10.1016/j.bmcl.2012.04.019
BindingDB Entry DOI: 10.7270/Q21C1XWX