BDBM50383727 CHEMBL2030389
SMILES: Brc1ccc2oc3c(nc(CN4CCCC4)[nH]c3=O)c2c1
InChI Key: InChIKey=WSZGOCPQOSHGAF-UHFFFAOYSA-N
Data: 6 IC50
Activity Spreadsheet -- Enzyme Inhibition Constant Data from BindingDB
Found 6 hits for monomerid = 50383727
Trg + Lig
Ki
nM
ΔG°
kcal/mole
IC50
nM
Kd
nM
EC50/IC50
nM
koff
s-1
kon
M-1s-1
pHTemp
°C
Cell division cycle 7-related protein kinase
(Homo sapiens (Human))
BDBM50383727
(CHEMBL2030389)
Show SMILES Brc1ccc2oc3c(nc(CN4CCCC4)[nH]c3=O)c2c1
Show InChI InChI=1S/C15H14BrN3O2/c16-9-3-4-11-10(7-9)13-14(21-11)15(20)18-12(17-13)8-19-5-1-2-6-19/h3-4,7H,1-2,5-6,8H2,(H,17,18,20)
Reactome pathway
n/an/a 3.70n/an/an/an/an/an/a
Exelixis
Curated by ChEMBL
Assay Description
Inhibition of N-terminus Myc-tagged human CDC7 expressed in Escherichia coli by chemiluminescence assay in presence of ATP
Bioorg Med Chem Lett 22: 3727-31 (2012)
Article DOI: 10.1016/j.bmcl.2012.04.024
BindingDB Entry DOI: 10.7270/Q20C4WS0
Serine/threonine-protein kinase pim-1
(Homo sapiens (Human))
BDBM50383727
(CHEMBL2030389)
Show SMILES Brc1ccc2oc3c(nc(CN4CCCC4)[nH]c3=O)c2c1
Show InChI InChI=1S/C15H14BrN3O2/c16-9-3-4-11-10(7-9)13-14(21-11)15(20)18-12(17-13)8-19-5-1-2-6-19/h3-4,7H,1-2,5-6,8H2,(H,17,18,20)
n/an/a 13n/an/an/an/an/an/a
Exelixis
Curated by ChEMBL
Assay Description
Inhibition of N-terminus His-tagged human PIM1 expressed in Escherichia coli using AKRRRLSA as substrate after 1 to 2 hrs by chemiluminescence assay
Bioorg Med Chem Lett 22: 3727-31 (2012)
Article DOI: 10.1016/j.bmcl.2012.04.024
BindingDB Entry DOI: 10.7270/Q20C4WS0
Serine/threonine-protein kinase pim-3
(Homo sapiens (Human))
BDBM50383727
(CHEMBL2030389)
Show SMILES Brc1ccc2oc3c(nc(CN4CCCC4)[nH]c3=O)c2c1
Show InChI InChI=1S/C15H14BrN3O2/c16-9-3-4-11-10(7-9)13-14(21-11)15(20)18-12(17-13)8-19-5-1-2-6-19/h3-4,7H,1-2,5-6,8H2,(H,17,18,20)
n/an/a 12n/an/an/an/an/an/a
Exelixis
Curated by ChEMBL
Assay Description
Inhibition of N-terminal His-tagged human PIM3 expressed in Escherichia coli using AKRRRLSA as substrate after 1 to 2 hrs by luciferasse-luciferin-co...
Bioorg Med Chem Lett 22: 3732-8 (2012)
Article DOI: 10.1016/j.bmcl.2012.04.025
BindingDB Entry DOI: 10.7270/Q2X34ZHV
Serine/threonine-protein kinase pim-1
(Homo sapiens (Human))
BDBM50383727
(CHEMBL2030389)
Show SMILES Brc1ccc2oc3c(nc(CN4CCCC4)[nH]c3=O)c2c1
Show InChI InChI=1S/C15H14BrN3O2/c16-9-3-4-11-10(7-9)13-14(21-11)15(20)18-12(17-13)8-19-5-1-2-6-19/h3-4,7H,1-2,5-6,8H2,(H,17,18,20)
n/an/a 13n/an/an/an/an/an/a
Exelixis
Curated by ChEMBL
Assay Description
Inhibition of N-terminal His-tagged human PIM1 expressed in Escherichia coli using AKRRRLSA as substrate after 1 to 2 hrs by luciferasse-luciferin-co...
Bioorg Med Chem Lett 22: 3732-8 (2012)
Article DOI: 10.1016/j.bmcl.2012.04.025
BindingDB Entry DOI: 10.7270/Q2X34ZHV
Serine/threonine-protein kinase pim-2
(Homo sapiens (Human))
BDBM50383727
(CHEMBL2030389)
Show SMILES Brc1ccc2oc3c(nc(CN4CCCC4)[nH]c3=O)c2c1
Show InChI InChI=1S/C15H14BrN3O2/c16-9-3-4-11-10(7-9)13-14(21-11)15(20)18-12(17-13)8-19-5-1-2-6-19/h3-4,7H,1-2,5-6,8H2,(H,17,18,20)
n/an/a 194n/an/an/an/an/an/a
Exelixis
Curated by ChEMBL
Assay Description
Inhibition of N-terminal His-tagged human PIM2 expressed in Escherichia coli using AKRRRLSA as substrate after 1 to 2 hrs by luciferasse-luciferin-co...
Bioorg Med Chem Lett 22: 3732-8 (2012)
Article DOI: 10.1016/j.bmcl.2012.04.025
BindingDB Entry DOI: 10.7270/Q2X34ZHV
Cell division cycle 7-related protein kinase
(Homo sapiens (Human))
BDBM50383727
(CHEMBL2030389)
Show SMILES Brc1ccc2oc3c(nc(CN4CCCC4)[nH]c3=O)c2c1
Show InChI InChI=1S/C15H14BrN3O2/c16-9-3-4-11-10(7-9)13-14(21-11)15(20)18-12(17-13)8-19-5-1-2-6-19/h3-4,7H,1-2,5-6,8H2,(H,17,18,20)
Reactome pathway
n/an/a 353n/an/an/an/an/an/a
Exelixis
Curated by ChEMBL
Assay Description
Inhibition of CDC7 in human MDA-MB-231T cells assessed as inhibition of MCM2 phosphorylation at Ser53 after 4 hrs
Bioorg Med Chem Lett 22: 3727-31 (2012)
Article DOI: 10.1016/j.bmcl.2012.04.024
BindingDB Entry DOI: 10.7270/Q20C4WS0