BDBM50383827 CHEMBL2030985
SMILES: Clc1ccc(NC(=O)c2cn(nc2-c2ccc(Cl)cc2)-c2ccccc2)cc1
InChI Key: InChIKey=TYXNDEBTEIAMBT-UHFFFAOYSA-N
Data: 1 IC50
Activity Spreadsheet -- Enzyme Inhibition Constant Data from BindingDB
Found 1 hit for monomerid = 50383827
Trg + Lig
Ki
nM
ΔG°
kcal/mole
IC50
nM
Kd
nM
EC50/IC50
nM
koff
s-1
kon
M-1s-1
pHTemp
°C
Aurora kinase A
(Homo sapiens (Human))
BDBM50383827
(CHEMBL2030985)
Show SMILES Clc1ccc(NC(=O)c2cn(nc2-c2ccc(Cl)cc2)-c2ccccc2)cc1
Show InChI InChI=1S/C22H15Cl2N3O/c23-16-8-6-15(7-9-16)21-20(14-27(26-21)19-4-2-1-3-5-19)22(28)25-18-12-10-17(24)11-13-18/h1-14H,(H,25,28)
NCI pathway
Reactome pathway
n/an/a 3.18E+3n/an/an/an/an/an/a
Nanjing University
Curated by ChEMBL
Assay Description
Inhibition of human recombinant Aurora A kinase using biotinylated peptide substrate preincubated for 15 mins with compound measured after 30 mins by...
Bioorg Med Chem Lett 22: 3589-93 (2012)
Article DOI: 10.1016/j.bmcl.2012.04.066
BindingDB Entry DOI: 10.7270/Q2GF0VJZ