BDBM50383830 CHEMBL2030988
SMILES: CCOc1ccc(NC(=O)c2cn(nc2-c2ccc(Cl)cc2)-c2ccccc2)cc1
InChI Key: InChIKey=IGZSIWVDEYTJAD-UHFFFAOYSA-N
Data: 1 IC50
Activity Spreadsheet -- Enzyme Inhibition Constant Data from BindingDB
Found 1 hit for monomerid = 50383830
Trg + Lig
Ki
nM
ΔG°
kcal/mole
IC50
nM
Kd
nM
EC50/IC50
nM
koff
s-1
kon
M-1s-1
pHTemp
°C
Aurora kinase A
(Homo sapiens (Human))
BDBM50383830
(CHEMBL2030988)
Show SMILES CCOc1ccc(NC(=O)c2cn(nc2-c2ccc(Cl)cc2)-c2ccccc2)cc1
Show InChI InChI=1S/C24H20ClN3O2/c1-2-30-21-14-12-19(13-15-21)26-24(29)22-16-28(20-6-4-3-5-7-20)27-23(22)17-8-10-18(25)11-9-17/h3-16H,2H2,1H3,(H,26,29)
NCI pathway
Reactome pathway
n/an/a 220n/an/an/an/an/an/a
Nanjing University
Curated by ChEMBL
Assay Description
Inhibition of human recombinant Aurora A kinase using biotinylated peptide substrate preincubated for 15 mins with compound measured after 30 mins by...
Bioorg Med Chem Lett 22: 3589-93 (2012)
Article DOI: 10.1016/j.bmcl.2012.04.066
BindingDB Entry DOI: 10.7270/Q2GF0VJZ