BDBM50383833 CHEMBL2030991
SMILES: [O-][N+](=O)c1ccc(cc1)-c1nn(cc1C(=O)Nc1ccc(Br)cc1)-c1ccccc1
InChI Key: InChIKey=ULOFNSCTALRSAB-UHFFFAOYSA-N
Data: 1 IC50
Activity Spreadsheet -- Enzyme Inhibition Constant Data from BindingDB
Found 1 hit for monomerid = 50383833
Trg + Lig
Ki
nM
ΔG°
kcal/mole
IC50
nM
Kd
nM
EC50/IC50
nM
koff
s-1
kon
M-1s-1
pHTemp
°C
Aurora kinase A
(Homo sapiens (Human))
BDBM50383833
(CHEMBL2030991)
Show SMILES [O-][N+](=O)c1ccc(cc1)-c1nn(cc1C(=O)Nc1ccc(Br)cc1)-c1ccccc1
Show InChI InChI=1S/C22H15BrN4O3/c23-16-8-10-17(11-9-16)24-22(28)20-14-26(18-4-2-1-3-5-18)25-21(20)15-6-12-19(13-7-15)27(29)30/h1-14H,(H,24,28)
NCI pathway
Reactome pathway
n/an/a 5.52E+3n/an/an/an/an/an/a
Nanjing University
Curated by ChEMBL
Assay Description
Inhibition of human recombinant Aurora A kinase using biotinylated peptide substrate preincubated for 15 mins with compound measured after 30 mins by...
Bioorg Med Chem Lett 22: 3589-93 (2012)
Article DOI: 10.1016/j.bmcl.2012.04.066
BindingDB Entry DOI: 10.7270/Q2GF0VJZ