null
SMILES: COc1ccc(NC(=O)c2cn(nc2-c2ccc(cc2)[N+]([O-])=O)-c2ccccc2)cc1
InChI Key: InChIKey=SCIAFCLDQIUAHV-UHFFFAOYSA-N
Activity Spreadsheet -- Enzyme Inhibition Constant Data from BindingDB
Found 1 hit for monomerid = 50383834
Trg + Lig
Ki
nM
ΔG°
kcal/mole
IC50
nM
Kd
nM
EC50/IC50
nM
koff
s-1
kon
M-1s-1
pHTemp
°C
Aurora kinase A
(Homo sapiens (Human))
BDBM50383834
(CHEMBL2030992)
Show SMILES COc1ccc(NC(=O)c2cn(nc2-c2ccc(cc2)[N+]([O-])=O)-c2ccccc2)cc1
Show InChI InChI=1S/C23H18N4O4/c1-31-20-13-9-17(10-14-20)24-23(28)21-15-26(18-5-3-2-4-6-18)25-22(21)16-7-11-19(12-8-16)27(29)30/h2-15H,1H3,(H,24,28)
NCI pathway
Reactome pathway
n/an/a 790n/an/an/an/an/an/a
Nanjing University
Curated by ChEMBL
Assay Description
Inhibition of human recombinant Aurora A kinase using biotinylated peptide substrate preincubated for 15 mins with compound measured after 30 mins by...
Bioorg Med Chem Lett 22: 3589-93 (2012)
Article DOI: 10.1016/j.bmcl.2012.04.066
BindingDB Entry DOI: 10.7270/Q2GF0VJZ