null
SMILES: CCOc1ccc(NC(=O)c2cn(nc2-c2ccc(C)cc2)-c2ccccc2)cc1
InChI Key: InChIKey=TXWUWDXRXZMUPG-UHFFFAOYSA-N
Activity Spreadsheet -- Enzyme Inhibition Constant Data from BindingDB
Found 1 hit for monomerid = 50383836
Trg + Lig
Ki
nM
ΔG°
kcal/mole
IC50
nM
Kd
nM
EC50/IC50
nM
koff
s-1
kon
M-1s-1
pHTemp
°C
Aurora kinase A
(Homo sapiens (Human))
BDBM50383836
(CHEMBL2030978)
Show SMILES CCOc1ccc(NC(=O)c2cn(nc2-c2ccc(C)cc2)-c2ccccc2)cc1
Show InChI InChI=1S/C25H23N3O2/c1-3-30-22-15-13-20(14-16-22)26-25(29)23-17-28(21-7-5-4-6-8-21)27-24(23)19-11-9-18(2)10-12-19/h4-17H,3H2,1-2H3,(H,26,29)
NCI pathway
Reactome pathway
n/an/a 650n/an/an/an/an/an/a
Nanjing University
Curated by ChEMBL
Assay Description
Inhibition of human recombinant Aurora A kinase using biotinylated peptide substrate preincubated for 15 mins with compound measured after 30 mins by...
Bioorg Med Chem Lett 22: 3589-93 (2012)
Article DOI: 10.1016/j.bmcl.2012.04.066
BindingDB Entry DOI: 10.7270/Q2GF0VJZ