BDBM50383975 CHEMBL2032112
SMILES: CC(C)C(=O)NC(=O)[C@@H]1CCCN1C(=O)[C@H](CC1CCCC1)CN(O)C=O
InChI Key: InChIKey=UONJQZXZLFFHJH-CVEARBPZSA-N
Data: 2 IC50
Activity Spreadsheet -- Enzyme Inhibition Constant Data from BindingDB
Found 2 hits for monomerid = 50383975
Trg + Lig
Ki
nM
ΔG°
kcal/mole
IC50
nM
Kd
nM
EC50/IC50
nM
koff
s-1
kon
M-1s-1
pHTemp
°C
Peptide deformylase
(Staphylococcus aureus)
BDBM50383975
(CHEMBL2032112)
Show SMILES CC(C)C(=O)NC(=O)[C@@H]1CCCN1C(=O)[C@H](CC1CCCC1)CN(O)C=O |r|
Show InChI InChI=1S/C19H31N3O5/c1-13(2)17(24)20-18(25)16-8-5-9-22(16)19(26)15(11-21(27)12-23)10-14-6-3-4-7-14/h12-16,27H,3-11H2,1-2H3,(H,20,24,25)/t15-,16+/m1/s1
n/an/a 5n/an/an/an/an/an/a
GlaxoSmithKline
Curated by ChEMBL
Assay Description
Inhibition of Staphylococcus aureus PDF assessed as formate release from fMAS peptide substrate after 20 mins by formate dehydrogenase coupled assay
Bioorg Med Chem Lett 22: 4028-32 (2012)
Article DOI: 10.1016/j.bmcl.2012.04.086
BindingDB Entry DOI: 10.7270/Q2K64K3V
Peptide deformylase
(Streptococcus pneumoniae serotype 4 (strain ATCC B...)
BDBM50383975
(CHEMBL2032112)
Show SMILES CC(C)C(=O)NC(=O)[C@@H]1CCCN1C(=O)[C@H](CC1CCCC1)CN(O)C=O |r|
Show InChI InChI=1S/C19H31N3O5/c1-13(2)17(24)20-18(25)16-8-5-9-22(16)19(26)15(11-21(27)12-23)10-14-6-3-4-7-14/h12-16,27H,3-11H2,1-2H3,(H,20,24,25)/t15-,16+/m1/s1
n/an/a 1.5n/an/an/an/an/an/a
GlaxoSmithKline
Curated by ChEMBL
Assay Description
Inhibition of Streptococcus pneumoniae PDF assessed as formate release from fMAS peptide substrate after 20 mins by formate dehydrogenase coupled ass...
Bioorg Med Chem Lett 22: 4028-32 (2012)
Article DOI: 10.1016/j.bmcl.2012.04.086
BindingDB Entry DOI: 10.7270/Q2K64K3V