BDBM50384008 CHEMBL2032296
SMILES: CC(=O)N1CCC(CC1)n1cc(cn1)-c1cnc(N)c(c1)-c1nc2c(C)c(O)c(C)cc2o1
InChI Key: InChIKey=NLUQUQNUBABAJP-UHFFFAOYSA-N
Data: 1 IC50
Activity Spreadsheet -- Enzyme Inhibition Constant Data from BindingDB
Found 1 hit for monomerid = 50384008
Trg + Lig
Ki
nM
ΔG°
kcal/mole
IC50
nM
Kd
nM
EC50/IC50
nM
koff
s-1
kon
M-1s-1
pHTemp
°C
Hepatocyte growth factor receptor
(Homo sapiens (Human))
BDBM50384008
(CHEMBL2032296)
Show SMILES CC(=O)N1CCC(CC1)n1cc(cn1)-c1cnc(N)c(c1)-c1nc2c(C)c(O)c(C)cc2o1
Show InChI InChI=1S/C24H26N6O3/c1-13-8-20-21(14(2)22(13)32)28-24(33-20)19-9-16(10-26-23(19)25)17-11-27-30(12-17)18-4-6-29(7-5-18)15(3)31/h8-12,18,32H,4-7H2,1-3H3,(H2,25,26)
n/an/a 28n/an/an/an/an/an/a
Korea Research Institute of Chemical Technology
Curated by ChEMBL
Assay Description
Inhibition of recombinant c-Met by time resolved-fluorescence resonance energy transfer analysis
Bioorg Med Chem Lett 22: 4044-8 (2012)
Article DOI: 10.1016/j.bmcl.2012.04.083
BindingDB Entry DOI: 10.7270/Q2FF3TC4