null
SMILES: Cc1ccc(cc1)S(=O)(=O)NC(=O)Nc1ccc2nc(oc2c1)-c1cc(cnc1N)-c1cnn(c1)C1CCNCC1
InChI Key: InChIKey=QHJAGBLQKDHNBD-UHFFFAOYSA-N
Activity Spreadsheet -- Enzyme Inhibition Constant Data from BindingDB
Found 3 hits for monomerid = 50384014
Trg + Lig
Ki
nM
ΔG°
kcal/mole
IC50
nM
Kd
nM
EC50/IC50
nM
koff
s-1
kon
M-1s-1
pHTemp
°C
G protein-coupled receptor kinase 5
(Homo sapiens (Human))
BDBM50384014
(CHEMBL2032290)
Show SMILES Cc1ccc(cc1)S(=O)(=O)NC(=O)Nc1ccc2nc(oc2c1)-c1cc(cnc1N)-c1cnn(c1)C1CCNCC1
Show InChI InChI=1S/C28H28N8O4S/c1-17-2-5-22(6-3-17)41(38,39)35-28(37)33-20-4-7-24-25(13-20)40-27(34-24)23-12-18(14-31-26(23)29)19-15-32-36(16-19)21-8-10-30-11-9-21/h2-7,12-16,21,30H,8-11H2,1H3,(H2,29,31)(H2,33,35,37)
NCI pathway
Reactome pathway
n/an/a 880n/an/an/an/an/an/a
Korea Research Institute of Chemical Technology
Curated by ChEMBL
Assay Description
Inhibition of GRK-5 (unknown origin) preincubated with enzyme for 10 mins before adding peptide substrate and ATP measured after 1 hr by LANCE-TR-FRE...
Bioorg Med Chem Lett 23: 6711-6 (2013)
Article DOI: 10.1016/j.bmcl.2013.10.036
BindingDB Entry DOI: 10.7270/Q2SX6FPP
Hepatocyte growth factor receptor
(Homo sapiens (Human))
BDBM50384014
(CHEMBL2032290)
Show SMILES Cc1ccc(cc1)S(=O)(=O)NC(=O)Nc1ccc2nc(oc2c1)-c1cc(cnc1N)-c1cnn(c1)C1CCNCC1
Show InChI InChI=1S/C28H28N8O4S/c1-17-2-5-22(6-3-17)41(38,39)35-28(37)33-20-4-7-24-25(13-20)40-27(34-24)23-12-18(14-31-26(23)29)19-15-32-36(16-19)21-8-10-30-11-9-21/h2-7,12-16,21,30H,8-11H2,1H3,(H2,29,31)(H2,33,35,37)
n/an/a 45n/an/an/an/an/an/a
Korea Research Institute of Chemical Technology
Curated by ChEMBL
Assay Description
Inhibition of recombinant c-Met by time resolved-fluorescence resonance energy transfer analysis
Bioorg Med Chem Lett 22: 4044-8 (2012)
Article DOI: 10.1016/j.bmcl.2012.04.083
BindingDB Entry DOI: 10.7270/Q2FF3TC4
Beta-adrenergic receptor kinase 1
(Homo sapiens (Human))
BDBM50384014
(CHEMBL2032290)
Show SMILES Cc1ccc(cc1)S(=O)(=O)NC(=O)Nc1ccc2nc(oc2c1)-c1cc(cnc1N)-c1cnn(c1)C1CCNCC1
Show InChI InChI=1S/C28H28N8O4S/c1-17-2-5-22(6-3-17)41(38,39)35-28(37)33-20-4-7-24-25(13-20)40-27(34-24)23-12-18(14-31-26(23)29)19-15-32-36(16-19)21-8-10-30-11-9-21/h2-7,12-16,21,30H,8-11H2,1H3,(H2,29,31)(H2,33,35,37)
Reactome pathway
n/an/a 8.30E+3n/an/an/an/an/an/a
Korea Research Institute of Chemical Technology
Curated by ChEMBL
Assay Description
Inhibition of GRK-2 (unknown origin) preincubated with enzyme for 10 mins before adding peptide substrate and ATP measured after 1 hr by LANCE-TR-FRE...
Bioorg Med Chem Lett 23: 6711-6 (2013)
Article DOI: 10.1016/j.bmcl.2013.10.036
BindingDB Entry DOI: 10.7270/Q2SX6FPP