BDBM50384036 CHEMBL2032157
SMILES: CC(C)Nc1cccc2nc(oc12)-c1cc(cnc1N)-c1cnn(c1)C1CCNCC1
InChI Key: InChIKey=HIRKHXQGCFMEGW-UHFFFAOYSA-N
Data: 1 IC50
Activity Spreadsheet -- Enzyme Inhibition Constant Data from BindingDB
Found 1 hit for monomerid = 50384036
Trg + Lig
Ki
nM
ΔG°
kcal/mole
IC50
nM
Kd
nM
EC50/IC50
nM
koff
s-1
kon
M-1s-1
pHTemp
°C
Hepatocyte growth factor receptor
(Homo sapiens (Human))
BDBM50384036
(CHEMBL2032157)
Show SMILES CC(C)Nc1cccc2nc(oc12)-c1cc(cnc1N)-c1cnn(c1)C1CCNCC1
Show InChI InChI=1S/C23H27N7O/c1-14(2)28-19-4-3-5-20-21(19)31-23(29-20)18-10-15(11-26-22(18)24)16-12-27-30(13-16)17-6-8-25-9-7-17/h3-5,10-14,17,25,28H,6-9H2,1-2H3,(H2,24,26)
n/an/a 130n/an/an/an/an/an/a
Korea Research Institute of Chemical Technology
Curated by ChEMBL
Assay Description
Inhibition of recombinant c-Met by time resolved-fluorescence resonance energy transfer analysis
Bioorg Med Chem Lett 22: 4044-8 (2012)
Article DOI: 10.1016/j.bmcl.2012.04.083
BindingDB Entry DOI: 10.7270/Q2FF3TC4