BDBM50384146 CHEMBL2029722
SMILES: CCN(CC(=O)NC1CC1)C(=O)c1ccc2n(C)c3CCC(Cc3c2c1)C1CCOCC1
InChI Key: InChIKey=MAAGUWONZDCLSO-UHFFFAOYSA-N
Data: 1 KI  1 IC50  1 EC50
Activity Spreadsheet -- Enzyme Inhibition Constant Data from BindingDB
Found 3 hits for monomerid = 50384146
Trg + Lig
Ki
nM
ΔG°
kcal/mole
IC50
nM
Kd
nM
EC50/IC50
nM
koff
s-1
kon
M-1s-1
pHTemp
°C
Cannabinoid receptor 1
(Homo sapiens (Human))
BDBM50384146
(CHEMBL2029722)
Show SMILES CCN(CC(=O)NC1CC1)C(=O)c1ccc2n(C)c3CCC(Cc3c2c1)C1CCOCC1
Show InChI InChI=1S/C26H35N3O3/c1-3-29(16-25(30)27-20-6-7-20)26(31)19-5-9-24-22(15-19)21-14-18(4-8-23(21)28(24)2)17-10-12-32-13-11-17/h5,9,15,17-18,20H,3-4,6-8,10-14,16H2,1-2H3,(H,27,30)
NCI pathway
Reactome pathway
7.30n/an/an/an/an/an/an/an/a
AstraZeneca
Curated by ChEMBL
Assay Description
Displacement of [3H]CP55940 from human CB1 receptor expressed in HEK293 cells
Bioorg Med Chem Lett 22: 3884-9 (2012)
Article DOI: 10.1016/j.bmcl.2012.04.128
BindingDB Entry DOI: 10.7270/Q28P61JV
Potassium voltage-gated channel subfamily H member 2
(Homo sapiens (Human))
BDBM50384146
(CHEMBL2029722)
Show SMILES CCN(CC(=O)NC1CC1)C(=O)c1ccc2n(C)c3CCC(Cc3c2c1)C1CCOCC1
Show InChI InChI=1S/C26H35N3O3/c1-3-29(16-25(30)27-20-6-7-20)26(31)19-5-9-24-22(15-19)21-14-18(4-8-23(21)28(24)2)17-10-12-32-13-11-17/h5,9,15,17-18,20H,3-4,6-8,10-14,16H2,1-2H3,(H,27,30)
Reactome pathway
n/an/a>3.30E+4n/an/an/an/an/an/a
AstraZeneca
Curated by ChEMBL
Assay Description
Inhibition of human ERG
Bioorg Med Chem Lett 22: 3884-9 (2012)
Article DOI: 10.1016/j.bmcl.2012.04.128
BindingDB Entry DOI: 10.7270/Q28P61JV
Cannabinoid receptor 1
(Homo sapiens (Human))
BDBM50384146
(CHEMBL2029722)
Show SMILES CCN(CC(=O)NC1CC1)C(=O)c1ccc2n(C)c3CCC(Cc3c2c1)C1CCOCC1
Show InChI InChI=1S/C26H35N3O3/c1-3-29(16-25(30)27-20-6-7-20)26(31)19-5-9-24-22(15-19)21-14-18(4-8-23(21)28(24)2)17-10-12-32-13-11-17/h5,9,15,17-18,20H,3-4,6-8,10-14,16H2,1-2H3,(H,27,30)
NCI pathway
Reactome pathway
n/an/an/an/a 6.20n/an/an/an/a
AstraZeneca
Curated by ChEMBL
Assay Description
Agonist activity at human CB1 receptor expressed in HEK293 cells assessed as [35S]GTPgamma binding
Bioorg Med Chem Lett 22: 3884-9 (2012)
Article DOI: 10.1016/j.bmcl.2012.04.128
BindingDB Entry DOI: 10.7270/Q28P61JV