BDBM50384251 CHEMBL2030446
SMILES: C[C@H]1COCCN1c1cc(CS(C)(=O)=O)nc(n1)-c1ccc2[nH]ccc2c1
InChI Key: InChIKey=XMHSFTLIAYTIQQ-ZDUSSCGKSA-N
Data: 3 IC50
Activity Spreadsheet -- Enzyme Inhibition Constant Data from BindingDB
Found 3 hits for monomerid = 50384251
Trg + Lig
Ki
nM
ΔG°
kcal/mole
IC50
nM
Kd
nM
EC50/IC50
nM
koff
s-1
kon
M-1s-1
pHTemp
°C
Potassium voltage-gated channel subfamily H member 2
(Homo sapiens (Human))
BDBM50384251
(CHEMBL2030446)
Show SMILES C[C@H]1COCCN1c1cc(CS(C)(=O)=O)nc(n1)-c1ccc2[nH]ccc2c1 |r|
Show InChI InChI=1S/C19H22N4O3S/c1-13-11-26-8-7-23(13)18-10-16(12-27(2,24)25)21-19(22-18)15-3-4-17-14(9-15)5-6-20-17/h3-6,9-10,13,20H,7-8,11-12H2,1-2H3/t13-/m0/s1
Reactome pathway
n/an/a>3.20E+4n/an/an/an/an/an/a
AstraZeneca
Curated by ChEMBL
Assay Description
Inhibition of human ERG by whole cell assay
Bioorg Med Chem Lett 22: 4163-8 (2012)
Article DOI: 10.1016/j.bmcl.2012.04.036
BindingDB Entry DOI: 10.7270/Q2N017KD
Serine/threonine-protein kinase mTOR
(Homo sapiens (Human))
BDBM50384251
(CHEMBL2030446)
Show SMILES C[C@H]1COCCN1c1cc(CS(C)(=O)=O)nc(n1)-c1ccc2[nH]ccc2c1 |r|
Show InChI InChI=1S/C19H22N4O3S/c1-13-11-26-8-7-23(13)18-10-16(12-27(2,24)25)21-19(22-18)15-3-4-17-14(9-15)5-6-20-17/h3-6,9-10,13,20H,7-8,11-12H2,1-2H3/t13-/m0/s1
NCI pathway
Reactome pathway
n/an/a 303n/an/an/an/an/an/a
AstraZeneca
Curated by ChEMBL
Assay Description
Inhibition of recombinant FLAG-tagged mTOR kinase expressed in HEK293 cells using Biotin-Ahx-Lys-Lys-Ala-Asn-Gln-Val-Phe-Leu-Gly-Phe-Thr-Tyr-Val-Ala-...
Bioorg Med Chem Lett 22: 4163-8 (2012)
Article DOI: 10.1016/j.bmcl.2012.04.036
BindingDB Entry DOI: 10.7270/Q2N017KD
Phosphatidylinositol 4,5-bisphosphate 3-kinase catalytic subunit alpha isoform
(Homo sapiens (Human))
BDBM50384251
(CHEMBL2030446)
Show SMILES C[C@H]1COCCN1c1cc(CS(C)(=O)=O)nc(n1)-c1ccc2[nH]ccc2c1 |r|
Show InChI InChI=1S/C19H22N4O3S/c1-13-11-26-8-7-23(13)18-10-16(12-27(2,24)25)21-19(22-18)15-3-4-17-14(9-15)5-6-20-17/h3-6,9-10,13,20H,7-8,11-12H2,1-2H3/t13-/m0/s1
NCI pathway
Reactome pathway
n/an/a 2.30E+4n/an/an/an/an/an/a
AstraZeneca
Curated by ChEMBL
Assay Description
Inhibition of human recombinant PI3Kalpha expressed in baculovirus system using PI(4,5)P2 as substrate after 20 mins
Bioorg Med Chem Lett 22: 4163-8 (2012)
Article DOI: 10.1016/j.bmcl.2012.04.036
BindingDB Entry DOI: 10.7270/Q2N017KD