BDBM50384258 CHEMBL2030443
SMILES: CS(=O)(=O)Cc1cc(nc(n1)-c1cccc(CO)c1)N1CCOCC1
InChI Key: InChIKey=SDAVLBYUVPQGLR-UHFFFAOYSA-N
Data: 2 IC50
Activity Spreadsheet -- Enzyme Inhibition Constant Data from BindingDB
Found 2 hits for monomerid = 50384258
Trg + Lig
Ki
nM
ΔG°
kcal/mole
IC50
nM
Kd
nM
EC50/IC50
nM
koff
s-1
kon
M-1s-1
pHTemp
°C
Serine/threonine-protein kinase mTOR
(Homo sapiens (Human))
BDBM50384258
(CHEMBL2030443)
Show SMILES CS(=O)(=O)Cc1cc(nc(n1)-c1cccc(CO)c1)N1CCOCC1
Show InChI InChI=1S/C17H21N3O4S/c1-25(22,23)12-15-10-16(20-5-7-24-8-6-20)19-17(18-15)14-4-2-3-13(9-14)11-21/h2-4,9-10,21H,5-8,11-12H2,1H3
NCI pathway
Reactome pathway
n/an/a 601n/an/an/an/an/an/a
AstraZeneca
Curated by ChEMBL
Assay Description
Inhibition of recombinant FLAG-tagged mTOR kinase expressed in HEK293 cells using Biotin-Ahx-Lys-Lys-Ala-Asn-Gln-Val-Phe-Leu-Gly-Phe-Thr-Tyr-Val-Ala-...
Bioorg Med Chem Lett 22: 4163-8 (2012)
Article DOI: 10.1016/j.bmcl.2012.04.036
BindingDB Entry DOI: 10.7270/Q2N017KD
Phosphatidylinositol 4,5-bisphosphate 3-kinase catalytic subunit alpha isoform
(Homo sapiens (Human))
BDBM50384258
(CHEMBL2030443)
Show SMILES CS(=O)(=O)Cc1cc(nc(n1)-c1cccc(CO)c1)N1CCOCC1
Show InChI InChI=1S/C17H21N3O4S/c1-25(22,23)12-15-10-16(20-5-7-24-8-6-20)19-17(18-15)14-4-2-3-13(9-14)11-21/h2-4,9-10,21H,5-8,11-12H2,1H3
NCI pathway
Reactome pathway
n/an/a 2.05E+3n/an/an/an/an/an/a
AstraZeneca
Curated by ChEMBL
Assay Description
Inhibition of human recombinant PI3Kalpha expressed in baculovirus system using PI(4,5)P2 as substrate after 20 mins
Bioorg Med Chem Lett 22: 4163-8 (2012)
Article DOI: 10.1016/j.bmcl.2012.04.036
BindingDB Entry DOI: 10.7270/Q2N017KD