BDBM50384305 CHEMBL2030667
SMILES: O=C(OCc1ccccc1)C1(Cc2ccccc2)CCC2CCCC(=O)N12
InChI Key: InChIKey=DHYDOGGNCHCNJT-UHFFFAOYSA-N
Data: 1 IC50
Activity Spreadsheet -- Enzyme Inhibition Constant Data from BindingDB
Found 1 hit for monomerid = 50384305
Trg + Lig
Ki
nM
ΔG°
kcal/mole
IC50
nM
Kd
nM
EC50/IC50
nM
koff
s-1
kon
M-1s-1
pHTemp
°C
Solute carrier family 12 member 5
(Rattus norvegicus)
BDBM50384305
(CHEMBL2030667)
Show SMILES O=C(OCc1ccccc1)C1(Cc2ccccc2)CCC2CCCC(=O)N12
Show InChI InChI=1S/C23H25NO3/c25-21-13-7-12-20-14-15-23(24(20)21,16-18-8-3-1-4-9-18)22(26)27-17-19-10-5-2-6-11-19/h1-6,8-11,20H,7,12-17H2
n/an/a 1.00E+3n/an/an/an/an/an/a
UCB Pharma
Curated by ChEMBL
Assay Description
Inhibition of rat KCC2 expressed in human Sk-Hep cells assessed as induction off Rb+ flux by atomic absorption spectroscopic analysis
Bioorg Med Chem Lett 22: 3978-82 (2012)
Article DOI: 10.1016/j.bmcl.2012.04.097
BindingDB Entry DOI: 10.7270/Q27P90FX