BDBM50384429 CHEMBL2031492::US9896452, Example 137
SMILES: C[C@H]1CCCN([C@@H]1CNC(=O)c1cccc2cccnc12)C(=O)c1nc(C)sc1-c1ccccc1
InChI Key: InChIKey=SRKVUFVTSRBFFN-FDDCHVKYSA-N
Data: 4 IC50
Activity Spreadsheet -- Enzyme Inhibition Constant Data from BindingDB
Found 4 hits for monomerid = 50384429
Trg + Lig
Ki
nM
ΔG°
kcal/mole
IC50
nM
Kd
nM
EC50/IC50
nM
koff
s-1
kon
M-1s-1
pHTemp
°C
Orexin receptor type 2
(Homo sapiens (Human))
BDBM50384429
(CHEMBL2031492 | US9896452, Example 137)
Show SMILES C[C@H]1CCCN([C@@H]1CNC(=O)c1cccc2cccnc12)C(=O)c1nc(C)sc1-c1ccccc1 |r|
Show InChI InChI=1S/C28H28N4O2S/c1-18-9-8-16-32(28(34)25-26(35-19(2)31-25)21-10-4-3-5-11-21)23(18)17-30-27(33)22-14-6-12-20-13-7-15-29-24(20)22/h3-7,10-15,18,23H,8-9,16-17H2,1-2H3,(H,30,33)/t18-,23+/m0/s1
Reactome pathway
n/an/a 82n/an/an/an/an/an/a
Scripps Florida
Curated by ChEMBL
Assay Description
Antagonist activity at OX2 receptor expressed in CHO cells assessed as inhibition of OXA-stimulated intracellular calcium mobilization after 30 mins ...
Bioorg Med Chem Lett 22: 3890-4 (2012)
Article DOI: 10.1016/j.bmcl.2012.04.122
BindingDB Entry DOI: 10.7270/Q2M046GG
Orexin receptor type 2
(Homo sapiens (Human))
BDBM50384429
(CHEMBL2031492 | US9896452, Example 137)
Show SMILES C[C@H]1CCCN([C@@H]1CNC(=O)c1cccc2cccnc12)C(=O)c1nc(C)sc1-c1ccccc1 |r|
Show InChI InChI=1S/C28H28N4O2S/c1-18-9-8-16-32(28(34)25-26(35-19(2)31-25)21-10-4-3-5-11-21)23(18)17-30-27(33)22-14-6-12-20-13-7-15-29-24(20)22/h3-7,10-15,18,23H,8-9,16-17H2,1-2H3,(H,30,33)/t18-,23+/m0/s1
Reactome pathway
US Patent
n/an/a 100n/an/an/an/an/an/a
University of Mississippi
Assay Description
Measurement of [Ca2+]i using a FLIPR: CHO-OX1 or CHO-OX2 cells are seeded into black-walled clear-base 384-well plates (Costar) at a density of 20,00...
J Med Chem 48: 2906-15 (2005)
BindingDB Entry DOI: 10.7270/Q22J6F5N
Orexin receptor type 1
(Homo sapiens (Human))
BDBM50384429
(CHEMBL2031492 | US9896452, Example 137)
Show SMILES C[C@H]1CCCN([C@@H]1CNC(=O)c1cccc2cccnc12)C(=O)c1nc(C)sc1-c1ccccc1 |r|
Show InChI InChI=1S/C28H28N4O2S/c1-18-9-8-16-32(28(34)25-26(35-19(2)31-25)21-10-4-3-5-11-21)23(18)17-30-27(33)22-14-6-12-20-13-7-15-29-24(20)22/h3-7,10-15,18,23H,8-9,16-17H2,1-2H3,(H,30,33)/t18-,23+/m0/s1
Reactome pathway
US Patent
n/an/a 3n/an/an/an/an/an/a
University of Mississippi
Assay Description
Measurement of [Ca2+]i using a FLIPR: CHO-OX1 or CHO-OX2 cells are seeded into black-walled clear-base 384-well plates (Costar) at a density of 20,00...
J Med Chem 48: 2906-15 (2005)
BindingDB Entry DOI: 10.7270/Q22J6F5N
Orexin receptor type 1
(Homo sapiens (Human))
BDBM50384429
(CHEMBL2031492 | US9896452, Example 137)
Show SMILES C[C@H]1CCCN([C@@H]1CNC(=O)c1cccc2cccnc12)C(=O)c1nc(C)sc1-c1ccccc1 |r|
Show InChI InChI=1S/C28H28N4O2S/c1-18-9-8-16-32(28(34)25-26(35-19(2)31-25)21-10-4-3-5-11-21)23(18)17-30-27(33)22-14-6-12-20-13-7-15-29-24(20)22/h3-7,10-15,18,23H,8-9,16-17H2,1-2H3,(H,30,33)/t18-,23+/m0/s1
Reactome pathway
n/an/a 2n/an/an/an/an/an/a
Scripps Florida
Curated by ChEMBL
Assay Description
Antagonist activity at OX1 receptor expressed in CHO cells assessed as inhibition of OXA-stimulated intracellular calcium mobilization after 30 mins ...
Bioorg Med Chem Lett 22: 3890-4 (2012)
Article DOI: 10.1016/j.bmcl.2012.04.122
BindingDB Entry DOI: 10.7270/Q2M046GG