BDBM50384598 CHEMBL2036788::US9744172, Compound UNC00000393A
SMILES: CNc1ncc2c(nn(CC3CCC(N)CC3)c2n1)-c1ccc(cc1)-c1ccccc1
InChI Key: InChIKey=UOYIIWVJEPEEOF-UHFFFAOYSA-N
Data: 4 IC50
Activity Spreadsheet -- Enzyme Inhibition Constant Data from BindingDB
Found 4 hits for monomerid = 50384598
Trg + Lig
Ki
nM
ΔG°
kcal/mole
IC50
nM
Kd
nM
EC50/IC50
nM
koff
s-1
kon
M-1s-1
pHTemp
°C
Tyrosine-protein kinase receptor UFO
(Homo sapiens (Human))
BDBM50384598
(CHEMBL2036788 | US9744172, Compound UNC00000393A)
Show SMILES CNc1ncc2c(nn(CC3CCC(N)CC3)c2n1)-c1ccc(cc1)-c1ccccc1 |(2.22,-28.77,;3.55,-29.54,;4.89,-28.77,;4.89,-27.22,;6.22,-26.45,;7.55,-27.22,;9.03,-26.74,;9.94,-27.99,;9.03,-29.25,;9.5,-30.71,;8.47,-31.86,;6.96,-31.52,;5.94,-32.66,;6.41,-34.13,;5.37,-35.27,;7.91,-34.45,;8.95,-33.31,;7.55,-28.77,;6.22,-29.54,;9.5,-25.27,;11.01,-24.96,;11.49,-23.49,;10.45,-22.35,;8.94,-22.68,;8.47,-24.14,;10.92,-20.89,;12.43,-20.57,;12.91,-19.11,;11.87,-17.96,;10.36,-18.29,;9.89,-19.75,)|
Show InChI InChI=1S/C25H28N6/c1-27-25-28-15-22-23(20-11-9-19(10-12-20)18-5-3-2-4-6-18)30-31(24(22)29-25)16-17-7-13-21(26)14-8-17/h2-6,9-12,15,17,21H,7-8,13-14,16,26H2,1H3,(H,27,28,29)
n/an/a 50n/an/an/an/an/an/a
TBA
Curated by ChEMBL
Assay Description
Inhibition of Axl using KKKKEEIYFFF-CONH2 as substrate after 180 mins by microfluid capillary electrophoresis assay
ACS Med Chem Lett 3: 129-134 (2012)
Article DOI: 10.1021/ml200239k
BindingDB Entry DOI: 10.7270/Q2F76DMC
Tyrosine-protein kinase Mer
(Homo sapiens (Human))
BDBM50384598
(CHEMBL2036788 | US9744172, Compound UNC00000393A)
Show SMILES CNc1ncc2c(nn(CC3CCC(N)CC3)c2n1)-c1ccc(cc1)-c1ccccc1 |(2.22,-28.77,;3.55,-29.54,;4.89,-28.77,;4.89,-27.22,;6.22,-26.45,;7.55,-27.22,;9.03,-26.74,;9.94,-27.99,;9.03,-29.25,;9.5,-30.71,;8.47,-31.86,;6.96,-31.52,;5.94,-32.66,;6.41,-34.13,;5.37,-35.27,;7.91,-34.45,;8.95,-33.31,;7.55,-28.77,;6.22,-29.54,;9.5,-25.27,;11.01,-24.96,;11.49,-23.49,;10.45,-22.35,;8.94,-22.68,;8.47,-24.14,;10.92,-20.89,;12.43,-20.57,;12.91,-19.11,;11.87,-17.96,;10.36,-18.29,;9.89,-19.75,)|
Show InChI InChI=1S/C25H28N6/c1-27-25-28-15-22-23(20-11-9-19(10-12-20)18-5-3-2-4-6-18)30-31(24(22)29-25)16-17-7-13-21(26)14-8-17/h2-6,9-12,15,17,21H,7-8,13-14,16,26H2,1H3,(H,27,28,29)
Reactome pathway
US Patent
n/an/a 55n/an/an/an/an/an/a
The University of North Carolina at Chapel Hill
US Patent
Assay Description
The ectopic expression of Mer receptor tyrosine kinase (Mer) has been identified as a tumor cell survival gene product in Acute Lymphoblastic Leukemi...
US Patent US9744172 (2017)
BindingDB Entry DOI: 10.7270/Q2PR7Z30
Tyrosine-protein kinase Mer
(Homo sapiens (Human))
BDBM50384598
(CHEMBL2036788 | US9744172, Compound UNC00000393A)
Show SMILES CNc1ncc2c(nn(CC3CCC(N)CC3)c2n1)-c1ccc(cc1)-c1ccccc1 |(2.22,-28.77,;3.55,-29.54,;4.89,-28.77,;4.89,-27.22,;6.22,-26.45,;7.55,-27.22,;9.03,-26.74,;9.94,-27.99,;9.03,-29.25,;9.5,-30.71,;8.47,-31.86,;6.96,-31.52,;5.94,-32.66,;6.41,-34.13,;5.37,-35.27,;7.91,-34.45,;8.95,-33.31,;7.55,-28.77,;6.22,-29.54,;9.5,-25.27,;11.01,-24.96,;11.49,-23.49,;10.45,-22.35,;8.94,-22.68,;8.47,-24.14,;10.92,-20.89,;12.43,-20.57,;12.91,-19.11,;11.87,-17.96,;10.36,-18.29,;9.89,-19.75,)|
Show InChI InChI=1S/C25H28N6/c1-27-25-28-15-22-23(20-11-9-19(10-12-20)18-5-3-2-4-6-18)30-31(24(22)29-25)16-17-7-13-21(26)14-8-17/h2-6,9-12,15,17,21H,7-8,13-14,16,26H2,1H3,(H,27,28,29)
Reactome pathway
n/an/a 56n/an/an/an/an/an/a
TBA
Curated by ChEMBL
Assay Description
Inhibition of Mer expressed in Escherichia coli BL21 (DE3) cells using EFPIYDFLPAKKK-CONH2 as substrate after 180 mins by microfluid capillary electr...
ACS Med Chem Lett 3: 129-134 (2012)
Article DOI: 10.1021/ml200239k
BindingDB Entry DOI: 10.7270/Q2F76DMC
Tyrosine-protein kinase receptor TYRO3
(Homo sapiens (Human))
BDBM50384598
(CHEMBL2036788 | US9744172, Compound UNC00000393A)
Show SMILES CNc1ncc2c(nn(CC3CCC(N)CC3)c2n1)-c1ccc(cc1)-c1ccccc1 |(2.22,-28.77,;3.55,-29.54,;4.89,-28.77,;4.89,-27.22,;6.22,-26.45,;7.55,-27.22,;9.03,-26.74,;9.94,-27.99,;9.03,-29.25,;9.5,-30.71,;8.47,-31.86,;6.96,-31.52,;5.94,-32.66,;6.41,-34.13,;5.37,-35.27,;7.91,-34.45,;8.95,-33.31,;7.55,-28.77,;6.22,-29.54,;9.5,-25.27,;11.01,-24.96,;11.49,-23.49,;10.45,-22.35,;8.94,-22.68,;8.47,-24.14,;10.92,-20.89,;12.43,-20.57,;12.91,-19.11,;11.87,-17.96,;10.36,-18.29,;9.89,-19.75,)|
Show InChI InChI=1S/C25H28N6/c1-27-25-28-15-22-23(20-11-9-19(10-12-20)18-5-3-2-4-6-18)30-31(24(22)29-25)16-17-7-13-21(26)14-8-17/h2-6,9-12,15,17,21H,7-8,13-14,16,26H2,1H3,(H,27,28,29)
n/an/a 120n/an/an/an/an/an/a
TBA
Curated by ChEMBL
Assay Description
Inhibition of Tyro3 using EFPIYDFLPAKKK-CONH2 as substrate after 180 mins by microfluid capillary electrophoresis assay
ACS Med Chem Lett 3: 129-134 (2012)
Article DOI: 10.1021/ml200239k
BindingDB Entry DOI: 10.7270/Q2F76DMC