BDBM50384743 CHEMBL2037235
SMILES: Cc1ccc(cc1)-n1sc(=O)n(Cc2ccccc2)c1=O
InChI Key: InChIKey=FKTXSHMMTSDZRV-UHFFFAOYSA-N
Data: 2 IC50
Activity Spreadsheet -- Enzyme Inhibition Constant Data from BindingDB
Found 2 hits for monomerid = 50384743
Trg + Lig
Ki
nM
ΔG°
kcal/mole
IC50
nM
Kd
nM
EC50/IC50
nM
koff
s-1
kon
M-1s-1
pHTemp
°C
Regulator of G-protein signaling 4 (RGS4)
(Homo sapiens (Human))
BDBM50384743
(CHEMBL2037235)
Show SMILES Cc1ccc(cc1)-n1sc(=O)n(Cc2ccccc2)c1=O
Show InChI InChI=1S/C16H14N2O2S/c1-12-7-9-14(10-8-12)18-15(19)17(16(20)21-18)11-13-5-3-2-4-6-13/h2-10H,11H2,1H3
n/an/a 14n/an/an/an/an/an/a
TBA
Curated by ChEMBL
Assay Description
Inhibition of RGS4 interaction with Galpha0 protein by flow cytometry protein interaction assay
ACS Med Chem Lett 3: 146-150 (2012)
Article DOI: 10.1021/ml200263y
BindingDB Entry DOI: 10.7270/Q2NS0VXW
Regulator of G-protein signaling 8
(Homo sapiens (Human))
BDBM50384743
(CHEMBL2037235)
Show SMILES Cc1ccc(cc1)-n1sc(=O)n(Cc2ccccc2)c1=O
Show InChI InChI=1S/C16H14N2O2S/c1-12-7-9-14(10-8-12)18-15(19)17(16(20)21-18)11-13-5-3-2-4-6-13/h2-10H,11H2,1H3
Reactome pathway
n/an/a 7.50E+3n/an/an/an/an/an/a
TBA
Curated by ChEMBL
Assay Description
Inhibition of RGS8 interaction with Galpha0 protein by flow cytometry protein interaction assay
ACS Med Chem Lett 3: 146-150 (2012)
Article DOI: 10.1021/ml200263y
BindingDB Entry DOI: 10.7270/Q2NS0VXW