BDBM50384763 CHEMBL2037360
SMILES: CCCCn1sc(=O)n(C)c1=O
InChI Key: InChIKey=APMGNFNFIZKFSR-UHFFFAOYSA-N
Data: 2 IC50
Activity Spreadsheet -- Enzyme Inhibition Constant Data from BindingDB
Found 2 hits for monomerid = 50384763
Trg + Lig
Ki
nM
ΔG°
kcal/mole
IC50
nM
Kd
nM
EC50/IC50
nM
koff
s-1
kon
M-1s-1
pHTemp
°C
Regulator of G-protein signaling 8
(Homo sapiens (Human))
BDBM50384763
(CHEMBL2037360)
Show SMILES CCCCn1sc(=O)n(C)c1=O
Show InChI InChI=1S/C7H12N2O2S/c1-3-4-5-9-6(10)8(2)7(11)12-9/h3-5H2,1-2H3
Reactome pathway
n/an/a 2.84E+4n/an/an/an/an/an/a
TBA
Curated by ChEMBL
Assay Description
Inhibition of RGS8 interaction with Galpha0 protein by flow cytometry protein interaction assay
ACS Med Chem Lett 3: 146-150 (2012)
Article DOI: 10.1021/ml200263y
BindingDB Entry DOI: 10.7270/Q2NS0VXW
Regulator of G-protein signaling 4 (RGS4)
(Homo sapiens (Human))
BDBM50384763
(CHEMBL2037360)
Show SMILES CCCCn1sc(=O)n(C)c1=O
Show InChI InChI=1S/C7H12N2O2S/c1-3-4-5-9-6(10)8(2)7(11)12-9/h3-5H2,1-2H3
n/an/a 24n/an/an/an/an/an/a
TBA
Curated by ChEMBL
Assay Description
Inhibition of RGS4 interaction with Galpha0 protein by flow cytometry protein interaction assay
ACS Med Chem Lett 3: 146-150 (2012)
Article DOI: 10.1021/ml200263y
BindingDB Entry DOI: 10.7270/Q2NS0VXW