BDBM50384799 CHEMBL2037483
SMILES: COc1ccc(cc1F)C1NC(NCc2ccccc2)SC1c1ccc(cc1)S(N)(=O)=O
InChI Key: InChIKey=CHPZLYNWDORWQT-UHFFFAOYSA-N
Data: 1 IC50
Activity Spreadsheet -- Enzyme Inhibition Constant Data from BindingDB
Found 1 hit for monomerid = 50384799
Trg + Lig
Ki
nM
ΔG°
kcal/mole
IC50
nM
Kd
nM
EC50/IC50
nM
koff
s-1
kon
M-1s-1
pHTemp
°C
Cyclooxygenase-1 (COX-1)
(Homo sapiens (Human))
BDBM50384799
(CHEMBL2037483)
Show SMILES COc1ccc(cc1F)C1NC(NCc2ccccc2)SC1c1ccc(cc1)S(N)(=O)=O
Show InChI InChI=1S/C23H24FN3O3S2/c1-30-20-12-9-17(13-19(20)24)21-22(16-7-10-18(11-8-16)32(25,28)29)31-23(27-21)26-14-15-5-3-2-4-6-15/h2-13,21-23,26-27H,14H2,1H3,(H2,25,28,29)
n/an/a 20n/an/an/an/an/an/a
Rheinische Friedrich-Wilhelms-Universit£t
Curated by ChEMBL
Assay Description
Inhibition of COX1
J Med Chem 55: 2932-42 (2012)
Article DOI: 10.1021/jm201706b
BindingDB Entry DOI: 10.7270/Q2RJ4KGS