BDBM50384877 CHEMBL2035183
SMILES: C(CN1CCCC1)Oc1ccc2Nc3nccc(n3)-c3ccc(COC\C=C\COCc1c2)s3
InChI Key: InChIKey=HXETYVYQZULBML-ONEGZZNKSA-N
Data: 9 IC50
Activity Spreadsheet -- Enzyme Inhibition Constant Data from BindingDB
Found 9 hits for monomerid = 50384877
Trg + Lig
Ki
nM
ΔG°
kcal/mole
IC50
nM
Kd
nM
EC50/IC50
nM
koff
s-1
kon
M-1s-1
pHTemp
°C
Cyclin-dependent kinase 2
(Homo sapiens (Human))
BDBM50384877
(CHEMBL2035183)
Show SMILES C(CN1CCCC1)Oc1ccc2Nc3nccc(n3)-c3ccc(COC\C=C\COCc1c2)s3 |t:28|
Show InChI InChI=1S/C26H30N4O3S/c1-2-12-30(11-1)13-16-33-24-7-5-21-17-20(24)18-31-14-3-4-15-32-19-22-6-8-25(34-22)23-9-10-27-26(28-21)29-23/h3-10,17H,1-2,11-16,18-19H2,(H,27,28,29)/b4-3+
NCI pathway
Reactome pathway
n/an/a 2.90E+3n/an/an/an/an/an/a
S BIO Pte. Ltd.
Curated by ChEMBL
Assay Description
Inhibition of recombinant CDK2 using RbING as substrate after 2 hrs by luminometric assay
J Med Chem 55: 2623-40 (2012)
Article DOI: 10.1021/jm201454n
BindingDB Entry DOI: 10.7270/Q2CC11RG
Non-receptor tyrosine-protein kinase TYK2
(Homo sapiens (Human))
BDBM50384877
(CHEMBL2035183)
Show SMILES C(CN1CCCC1)Oc1ccc2Nc3nccc(n3)-c3ccc(COC\C=C\COCc1c2)s3 |t:28|
Show InChI InChI=1S/C26H30N4O3S/c1-2-12-30(11-1)13-16-33-24-7-5-21-17-20(24)18-31-14-3-4-15-32-19-22-6-8-25(34-22)23-9-10-27-26(28-21)29-23/h3-10,17H,1-2,11-16,18-19H2,(H,27,28,29)/b4-3+
n/an/a 32n/an/an/an/an/an/a
S BIO Pte. Ltd.
Curated by ChEMBL
Assay Description
Inhibition of TYK2
J Med Chem 55: 2623-40 (2012)
Article DOI: 10.1021/jm201454n
BindingDB Entry DOI: 10.7270/Q2CC11RG
Cytochrome P450 3A4
(Homo sapiens (Human))
BDBM50384877
(CHEMBL2035183)
Show SMILES C(CN1CCCC1)Oc1ccc2Nc3nccc(n3)-c3ccc(COC\C=C\COCc1c2)s3 |t:28|
Show InChI InChI=1S/C26H30N4O3S/c1-2-12-30(11-1)13-16-33-24-7-5-21-17-20(24)18-31-14-3-4-15-32-19-22-6-8-25(34-22)23-9-10-27-26(28-21)29-23/h3-10,17H,1-2,11-16,18-19H2,(H,27,28,29)/b4-3+
Reactome pathway
n/an/a>1.00E+4n/an/an/an/an/an/a
S BIO Pte. Ltd.
Curated by ChEMBL
Assay Description
Inhibition of CYP3A4 in human liver microsomes using testosterone as substrate by LC-MS/MS analysis
J Med Chem 55: 2623-40 (2012)
Article DOI: 10.1021/jm201454n
BindingDB Entry DOI: 10.7270/Q2CC11RG
Cytochrome P450 2D6
(Homo sapiens (Human))
BDBM50384877
(CHEMBL2035183)
Show SMILES C(CN1CCCC1)Oc1ccc2Nc3nccc(n3)-c3ccc(COC\C=C\COCc1c2)s3 |t:28|
Show InChI InChI=1S/C26H30N4O3S/c1-2-12-30(11-1)13-16-33-24-7-5-21-17-20(24)18-31-14-3-4-15-32-19-22-6-8-25(34-22)23-9-10-27-26(28-21)29-23/h3-10,17H,1-2,11-16,18-19H2,(H,27,28,29)/b4-3+
n/an/a>1.00E+4n/an/an/an/an/an/a
S BIO Pte. Ltd.
Curated by ChEMBL
Assay Description
Inhibition of CYP2D6 in human liver microsomes using dextromethorphan as substrate by LC-MS/MS analysis
J Med Chem 55: 2623-40 (2012)
Article DOI: 10.1021/jm201454n
BindingDB Entry DOI: 10.7270/Q2CC11RG
Tyrosine-protein kinase JAK3
(Homo sapiens (Human))
BDBM50384877
(CHEMBL2035183)
Show SMILES C(CN1CCCC1)Oc1ccc2Nc3nccc(n3)-c3ccc(COC\C=C\COCc1c2)s3 |t:28|
Show InChI InChI=1S/C26H30N4O3S/c1-2-12-30(11-1)13-16-33-24-7-5-21-17-20(24)18-31-14-3-4-15-32-19-22-6-8-25(34-22)23-9-10-27-26(28-21)29-23/h3-10,17H,1-2,11-16,18-19H2,(H,27,28,29)/b4-3+
Reactome pathway
n/an/a 650n/an/an/an/an/an/a
S BIO Pte. Ltd.
Curated by ChEMBL
Assay Description
Inhibition of recombinant JAK3 using poly(Glu,Ala,Tyr) as substrate after 2 hrs by luminometric assay
J Med Chem 55: 2623-40 (2012)
Article DOI: 10.1021/jm201454n
BindingDB Entry DOI: 10.7270/Q2CC11RG
Tyrosine-protein kinase JAK1
(Homo sapiens (Human))
BDBM50384877
(CHEMBL2035183)
Show SMILES C(CN1CCCC1)Oc1ccc2Nc3nccc(n3)-c3ccc(COC\C=C\COCc1c2)s3 |t:28|
Show InChI InChI=1S/C26H30N4O3S/c1-2-12-30(11-1)13-16-33-24-7-5-21-17-20(24)18-31-14-3-4-15-32-19-22-6-8-25(34-22)23-9-10-27-26(28-21)29-23/h3-10,17H,1-2,11-16,18-19H2,(H,27,28,29)/b4-3+
Reactome pathway
n/an/a 420n/an/an/an/an/an/a
S BIO Pte. Ltd.
Curated by ChEMBL
Assay Description
Inhibition of recombinant JAK1 using poly(Glu,Ala,Tyr) as substrate after 2 hrs by luminometric assay
J Med Chem 55: 2623-40 (2012)
Article DOI: 10.1021/jm201454n
BindingDB Entry DOI: 10.7270/Q2CC11RG
Tyrosine-protein kinase JAK2
(Homo sapiens (Human))
BDBM50384877
(CHEMBL2035183)
Show SMILES C(CN1CCCC1)Oc1ccc2Nc3nccc(n3)-c3ccc(COC\C=C\COCc1c2)s3 |t:28|
Show InChI InChI=1S/C26H30N4O3S/c1-2-12-30(11-1)13-16-33-24-7-5-21-17-20(24)18-31-14-3-4-15-32-19-22-6-8-25(34-22)23-9-10-27-26(28-21)29-23/h3-10,17H,1-2,11-16,18-19H2,(H,27,28,29)/b4-3+
Reactome pathway
n/an/a 7.30n/an/an/an/an/an/a
S BIO Pte. Ltd.
Curated by ChEMBL
Assay Description
Inhibition of recombinant JAK2 using poly(Glu,Ala,Tyr) as substrate after 2 hrs by luminometric assay
J Med Chem 55: 2623-40 (2012)
Article DOI: 10.1021/jm201454n
BindingDB Entry DOI: 10.7270/Q2CC11RG
Receptor-type tyrosine-protein kinase FLT3
(Homo sapiens (Human))
BDBM50384877
(CHEMBL2035183)
Show SMILES C(CN1CCCC1)Oc1ccc2Nc3nccc(n3)-c3ccc(COC\C=C\COCc1c2)s3 |t:28|
Show InChI InChI=1S/C26H30N4O3S/c1-2-12-30(11-1)13-16-33-24-7-5-21-17-20(24)18-31-14-3-4-15-32-19-22-6-8-25(34-22)23-9-10-27-26(28-21)29-23/h3-10,17H,1-2,11-16,18-19H2,(H,27,28,29)/b4-3+
n/an/a 24n/an/an/an/an/an/a
S BIO Pte. Ltd.
Curated by ChEMBL
Assay Description
Inhibition of recombinant FLT3 using poly(Glu,Tyr) as substrate after 2 hrs by luminometric assay
J Med Chem 55: 2623-40 (2012)
Article DOI: 10.1021/jm201454n
BindingDB Entry DOI: 10.7270/Q2CC11RG
Potassium voltage-gated channel subfamily H member 2
(Homo sapiens (Human))
BDBM50384877
(CHEMBL2035183)
Show SMILES C(CN1CCCC1)Oc1ccc2Nc3nccc(n3)-c3ccc(COC\C=C\COCc1c2)s3 |t:28|
Show InChI InChI=1S/C26H30N4O3S/c1-2-12-30(11-1)13-16-33-24-7-5-21-17-20(24)18-31-14-3-4-15-32-19-22-6-8-25(34-22)23-9-10-27-26(28-21)29-23/h3-10,17H,1-2,11-16,18-19H2,(H,27,28,29)/b4-3+
Reactome pathway
n/an/a 7.20E+3n/an/an/an/an/an/a
S BIO Pte. Ltd.
Curated by ChEMBL
Assay Description
Displacement of dofetilide from human ERG
J Med Chem 55: 2623-40 (2012)
Article DOI: 10.1021/jm201454n
BindingDB Entry DOI: 10.7270/Q2CC11RG