BDBM50384928 CHEMBL2036635
SMILES: C[C@@H]1CCCN1CCCOc1ccc(cc1)C(=O)CN1CCN(CC1)C(=O)c1ccccc1
InChI Key: InChIKey=PMRJMYCLQDPGBL-JOCHJYFZSA-N
Data: 2 KI  5 IC50  1 EC50
Activity Spreadsheet -- Enzyme Inhibition Constant Data from BindingDB
Found 8 hits for monomerid = 50384928
Trg + Lig
Ki
nM
ΔG°
kcal/mole
IC50
nM
Kd
nM
EC50/IC50
nM
koff
s-1
kon
M-1s-1
pHTemp
°C
Histamine H3 receptor
(Homo sapiens (Human))
BDBM50384928
(CHEMBL2036635)
Show SMILES C[C@@H]1CCCN1CCCOc1ccc(cc1)C(=O)CN1CCN(CC1)C(=O)c1ccccc1 |r|
Show InChI InChI=1S/C27H35N3O3/c1-22-7-5-14-29(22)15-6-20-33-25-12-10-23(11-13-25)26(31)21-28-16-18-30(19-17-28)27(32)24-8-3-2-4-9-24/h2-4,8-13,22H,5-7,14-21H2,1H3/t22-/m1/s1
Reactome pathway
1.90n/an/an/an/an/an/an/an/a
Cephalon, Inc.
Curated by ChEMBL
Assay Description
Displacement of [3H]NAMH from human histamine H3 receptor expressed in CHO cells
Bioorg Med Chem Lett 22: 2807-10 (2012)
Article DOI: 10.1016/j.bmcl.2012.02.081
BindingDB Entry DOI: 10.7270/Q26M37VX
Histamine H3 receptor
(Rattus norvegicus (rat))
BDBM50384928
(CHEMBL2036635)
Show SMILES C[C@@H]1CCCN1CCCOc1ccc(cc1)C(=O)CN1CCN(CC1)C(=O)c1ccccc1 |r|
Show InChI InChI=1S/C27H35N3O3/c1-22-7-5-14-29(22)15-6-20-33-25-12-10-23(11-13-25)26(31)21-28-16-18-30(19-17-28)27(32)24-8-3-2-4-9-24/h2-4,8-13,22H,5-7,14-21H2,1H3/t22-/m1/s1
Reactome pathway
14n/an/an/an/an/an/an/an/a
Cephalon, Inc.
Curated by ChEMBL
Assay Description
Displacement of [3H]NAMH from rat histamine H3 receptor expressed in CHO cells
Bioorg Med Chem Lett 22: 2807-10 (2012)
Article DOI: 10.1016/j.bmcl.2012.02.081
BindingDB Entry DOI: 10.7270/Q26M37VX
Histamine H3 receptor
(Homo sapiens (Human))
BDBM50384928
(CHEMBL2036635)
Show SMILES C[C@@H]1CCCN1CCCOc1ccc(cc1)C(=O)CN1CCN(CC1)C(=O)c1ccccc1 |r|
Show InChI InChI=1S/C27H35N3O3/c1-22-7-5-14-29(22)15-6-20-33-25-12-10-23(11-13-25)26(31)21-28-16-18-30(19-17-28)27(32)24-8-3-2-4-9-24/h2-4,8-13,22H,5-7,14-21H2,1H3/t22-/m1/s1
Reactome pathway
n/an/an/an/a 1n/an/an/an/a
Cephalon, Inc.
Curated by ChEMBL
Assay Description
Inverse agonist activity at human histamine H3 receptor by [35S]-GTPgammaS binding assay
Bioorg Med Chem Lett 22: 2807-10 (2012)
Article DOI: 10.1016/j.bmcl.2012.02.081
BindingDB Entry DOI: 10.7270/Q26M37VX
Cytochrome P450 1A
(Homo sapiens (Human))
BDBM50384928
(CHEMBL2036635)
Show SMILES C[C@@H]1CCCN1CCCOc1ccc(cc1)C(=O)CN1CCN(CC1)C(=O)c1ccccc1 |r|
Show InChI InChI=1S/C27H35N3O3/c1-22-7-5-14-29(22)15-6-20-33-25-12-10-23(11-13-25)26(31)21-28-16-18-30(19-17-28)27(32)24-8-3-2-4-9-24/h2-4,8-13,22H,5-7,14-21H2,1H3/t22-/m1/s1
Reactome pathway
n/an/a>3.00E+4n/an/an/an/an/an/a
Cephalon, Inc.
Curated by ChEMBL
Assay Description
Inhibition of CYP1A2
Bioorg Med Chem Lett 22: 2807-10 (2012)
Article DOI: 10.1016/j.bmcl.2012.02.081
BindingDB Entry DOI: 10.7270/Q26M37VX
Cytochrome P450 3A4
(Homo sapiens (Human))
BDBM50384928
(CHEMBL2036635)
Show SMILES C[C@@H]1CCCN1CCCOc1ccc(cc1)C(=O)CN1CCN(CC1)C(=O)c1ccccc1 |r|
Show InChI InChI=1S/C27H35N3O3/c1-22-7-5-14-29(22)15-6-20-33-25-12-10-23(11-13-25)26(31)21-28-16-18-30(19-17-28)27(32)24-8-3-2-4-9-24/h2-4,8-13,22H,5-7,14-21H2,1H3/t22-/m1/s1
Reactome pathway
n/an/a>3.00E+4n/an/an/an/an/an/a
Cephalon, Inc.
Curated by ChEMBL
Assay Description
Inhibition of CYP3A4
Bioorg Med Chem Lett 22: 2807-10 (2012)
Article DOI: 10.1016/j.bmcl.2012.02.081
BindingDB Entry DOI: 10.7270/Q26M37VX
Cytochrome P450 2C19
(Homo sapiens (Human))
BDBM50384928
(CHEMBL2036635)
Show SMILES C[C@@H]1CCCN1CCCOc1ccc(cc1)C(=O)CN1CCN(CC1)C(=O)c1ccccc1 |r|
Show InChI InChI=1S/C27H35N3O3/c1-22-7-5-14-29(22)15-6-20-33-25-12-10-23(11-13-25)26(31)21-28-16-18-30(19-17-28)27(32)24-8-3-2-4-9-24/h2-4,8-13,22H,5-7,14-21H2,1H3/t22-/m1/s1
Reactome pathway
n/an/a>3.00E+4n/an/an/an/an/an/a
Cephalon, Inc.
Curated by ChEMBL
Assay Description
Inhibition of CYP2C19
Bioorg Med Chem Lett 22: 2807-10 (2012)
Article DOI: 10.1016/j.bmcl.2012.02.081
BindingDB Entry DOI: 10.7270/Q26M37VX
Cytochrome P450 2C9
(Homo sapiens (Human))
BDBM50384928
(CHEMBL2036635)
Show SMILES C[C@@H]1CCCN1CCCOc1ccc(cc1)C(=O)CN1CCN(CC1)C(=O)c1ccccc1 |r|
Show InChI InChI=1S/C27H35N3O3/c1-22-7-5-14-29(22)15-6-20-33-25-12-10-23(11-13-25)26(31)21-28-16-18-30(19-17-28)27(32)24-8-3-2-4-9-24/h2-4,8-13,22H,5-7,14-21H2,1H3/t22-/m1/s1
Reactome pathway
n/an/a>3.00E+4n/an/an/an/an/an/a
Cephalon, Inc.
Curated by ChEMBL
Assay Description
Inhibition of CYP2C9
Bioorg Med Chem Lett 22: 2807-10 (2012)
Article DOI: 10.1016/j.bmcl.2012.02.081
BindingDB Entry DOI: 10.7270/Q26M37VX
Cytochrome P450 2D6
(Homo sapiens (Human))
BDBM50384928
(CHEMBL2036635)
Show SMILES C[C@@H]1CCCN1CCCOc1ccc(cc1)C(=O)CN1CCN(CC1)C(=O)c1ccccc1 |r|
Show InChI InChI=1S/C27H35N3O3/c1-22-7-5-14-29(22)15-6-20-33-25-12-10-23(11-13-25)26(31)21-28-16-18-30(19-17-28)27(32)24-8-3-2-4-9-24/h2-4,8-13,22H,5-7,14-21H2,1H3/t22-/m1/s1
n/an/a>3.00E+4n/an/an/an/an/an/a
Cephalon, Inc.
Curated by ChEMBL
Assay Description
Inhibition of CYP2D6
Bioorg Med Chem Lett 22: 2807-10 (2012)
Article DOI: 10.1016/j.bmcl.2012.02.081
BindingDB Entry DOI: 10.7270/Q26M37VX