BDBM50385144 CHEMBL2035653
SMILES: Cc1cc2ccccc2c(n1)-c1ccc(cc1)C(=O)NCCN1CCOCC1
InChI Key: InChIKey=TUUADNJAZQZKLA-UHFFFAOYSA-N
Data: 1 IC50
PDB links: 1 PDB ID matches this monomer.
Activity Spreadsheet -- Enzyme Inhibition Constant Data from BindingDB
Found 1 hit for monomerid = 50385144
Trg + Lig
Ki
nM
ΔG°
kcal/mole
IC50
nM
Kd
nM
EC50/IC50
nM
koff
s-1
kon
M-1s-1
pHTemp
°C
Prostaglandin D Synthase
(Homo sapiens (Human))
BDBM50385144
(CHEMBL2035653)
Show SMILES Cc1cc2ccccc2c(n1)-c1ccc(cc1)C(=O)NCCN1CCOCC1
Show InChI InChI=1S/C23H25N3O2/c1-17-16-20-4-2-3-5-21(20)22(25-17)18-6-8-19(9-7-18)23(27)24-10-11-26-12-14-28-15-13-26/h2-9,16H,10-15H2,1H3,(H,24,27)
Reactome pathway
n/an/a 8.26n/an/an/an/an/an/a
Pfizer Inc.
Curated by ChEMBL
Assay Description
Inhibition of human recombinant HPGDS using PGH2 as substrate assessed as production of PGD2 preincubated for 10 mins prior substrate addition measur...
Bioorg Med Chem Lett 22: 3795-9 (2012)
Article DOI: 10.1016/j.bmcl.2012.04.004
BindingDB Entry DOI: 10.7270/Q28C9X82
3D
3D Structure (crystal)