BDBM50385145 CHEMBL2035654
SMILES: Oc1ccc2ccccc2c1-c1ccc(cc1)C(=O)NCCN1CCOCC1
InChI Key: InChIKey=MQRMUEVIQDAAEW-UHFFFAOYSA-N
Data: 1 IC50
Activity Spreadsheet -- Enzyme Inhibition Constant Data from BindingDB
Found 1 hit for monomerid = 50385145
Trg + Lig
Ki
nM
ΔG°
kcal/mole
IC50
nM
Kd
nM
EC50/IC50
nM
koff
s-1
kon
M-1s-1
pHTemp
°C
Prostaglandin D Synthase
(Homo sapiens (Human))
BDBM50385145
(CHEMBL2035654)
Show SMILES Oc1ccc2ccccc2c1-c1ccc(cc1)C(=O)NCCN1CCOCC1
Show InChI InChI=1S/C23H24N2O3/c26-21-10-9-17-3-1-2-4-20(17)22(21)18-5-7-19(8-6-18)23(27)24-11-12-25-13-15-28-16-14-25/h1-10,26H,11-16H2,(H,24,27)
Reactome pathway
n/an/a 662n/an/an/an/an/an/a
Pfizer Inc.
Curated by ChEMBL
Assay Description
Inhibition of human recombinant HPGDS using PGH2 as substrate assessed as production of PGD2 preincubated for 10 mins prior substrate addition measur...
Bioorg Med Chem Lett 22: 3795-9 (2012)
Article DOI: 10.1016/j.bmcl.2012.04.004
BindingDB Entry DOI: 10.7270/Q28C9X82
3D
3D Structure (docked)