null
SMILES: O=C(Nc1ccc(cc1)N1CCN(CC1)C(=O)N1CCOCC1)c1cnc(Oc2ccccc2)nc1
InChI Key: InChIKey=PCIKWORRPUDTHB-UHFFFAOYSA-N
Activity Spreadsheet -- Enzyme Inhibition Constant Data from BindingDB
Found 1 hit for monomerid = 50385149
Trg + Lig
Ki
nM
ΔG°
kcal/mole
IC50
nM
Kd
nM
EC50/IC50
nM
koff
s-1
kon
M-1s-1
pHTemp
°C
Hematopoietic prostaglandin D synthase
(Homo sapiens (Human))
BDBM50385149
(CHEMBL2035649)
Show SMILES O=C(Nc1ccc(cc1)N1CCN(CC1)C(=O)N1CCOCC1)c1cnc(Oc2ccccc2)nc1
Show InChI InChI=1S/C26H28N6O4/c33-24(20-18-27-25(28-19-20)36-23-4-2-1-3-5-23)29-21-6-8-22(9-7-21)30-10-12-31(13-11-30)26(34)32-14-16-35-17-15-32/h1-9,18-19H,10-17H2,(H,29,33)
Reactome pathway
n/an/a 280n/an/an/an/an/an/a
Pfizer Inc.
Curated by ChEMBL
Assay Description
Inhibition of HPGDS
Bioorg Med Chem Lett 22: 3795-9 (2012)
Article DOI: 10.1016/j.bmcl.2012.04.004
BindingDB Entry DOI: 10.7270/Q28C9X82