BDBM50385277 CHEMBL2035486
SMILES: Fc1ccc2c(c1)[se]n(CCCCCn1[se]c3cc(F)ccc3c1=O)c2=O
InChI Key: InChIKey=RRRWJSWBQYFDAK-UHFFFAOYSA-N
Data: 1 IC50
Activity Spreadsheet -- Enzyme Inhibition Constant Data from BindingDB
Found 1 hit for monomerid = 50385277
Trg + Lig
Ki
nM
ΔG°
kcal/mole
IC50
nM
Kd
nM
EC50/IC50
nM
koff
s-1
kon
M-1s-1
pHTemp
°C
Thioredoxin reductase 1, cytoplasmic
(Rattus norvegicus)
BDBM50385277
(CHEMBL2035486)
Show SMILES Fc1ccc2c(c1)[se]n(CCCCCn1[se]c3cc(F)ccc3c1=O)c2=O
Show InChI InChI=1S/C19H16F2N2O2Se2/c20-12-4-6-14-16(10-12)26-22(18(14)24)8-2-1-3-9-23-19(25)15-7-5-13(21)11-17(15)27-23/h4-7,10-11H,1-3,8-9H2
n/an/a 2.91E+3n/an/an/an/an/an/a
Peking University
Curated by ChEMBL
Assay Description
Inhibition of TrxR1 in rat liver homogenate preincubated for 5 mins measured by DNTB assay
Bioorg Med Chem 20: 3816-27 (2012)
Article DOI: 10.1016/j.bmc.2012.04.033
BindingDB Entry DOI: 10.7270/Q2V69KND