BDBM50385278 CHEMBL2035485
SMILES: Fc1ccc2c(c1)[se]n(CCn1[se]c3cc(F)ccc3c1=O)c2=O
InChI Key: InChIKey=NVKLMJZXBQGXPP-UHFFFAOYSA-N
Data: 1 IC50
Activity Spreadsheet -- Enzyme Inhibition Constant Data from BindingDB
Found 1 hit for monomerid = 50385278
Trg + Lig
Ki
nM
ΔG°
kcal/mole
IC50
nM
Kd
nM
EC50/IC50
nM
koff
s-1
kon
M-1s-1
pHTemp
°C
Thioredoxin reductase 1, cytoplasmic
(Rattus norvegicus)
BDBM50385278
(CHEMBL2035485)
Show SMILES Fc1ccc2c(c1)[se]n(CCn1[se]c3cc(F)ccc3c1=O)c2=O
Show InChI InChI=1S/C16H10F2N2O2Se2/c17-9-1-3-11-13(7-9)23-19(15(11)21)5-6-20-16(22)12-4-2-10(18)8-14(12)24-20/h1-4,7-8H,5-6H2
n/an/a 820n/an/an/an/an/an/a
Peking University
Curated by ChEMBL
Assay Description
Inhibition of TrxR1 in rat liver homogenate preincubated for 5 mins measured by DNTB assay
Bioorg Med Chem 20: 3816-27 (2012)
Article DOI: 10.1016/j.bmc.2012.04.033
BindingDB Entry DOI: 10.7270/Q2V69KND