BDBM50385285 CHEMBL2035478
SMILES: Fc1ccc2[se]n(CCCCCn3[se]c4ccc(F)cc4c3=O)c(=O)c2c1
InChI Key: InChIKey=NWKZXHXHWKAVLH-UHFFFAOYSA-N
Data: 1 IC50
Activity Spreadsheet -- Enzyme Inhibition Constant Data from BindingDB
Found 1 hit for monomerid = 50385285
Trg + Lig
Ki
nM
ΔG°
kcal/mole
IC50
nM
Kd
nM
EC50/IC50
nM
koff
s-1
kon
M-1s-1
pHTemp
°C
Thioredoxin reductase 1, cytoplasmic
(Rattus norvegicus)
BDBM50385285
(CHEMBL2035478)
Show SMILES Fc1ccc2[se]n(CCCCCn3[se]c4ccc(F)cc4c3=O)c(=O)c2c1
Show InChI InChI=1S/C19H16F2N2O2Se2/c20-12-4-6-16-14(10-12)18(24)22(26-16)8-2-1-3-9-23-19(25)15-11-13(21)5-7-17(15)27-23/h4-7,10-11H,1-3,8-9H2
n/an/a 3.87E+3n/an/an/an/an/an/a
Peking University
Curated by ChEMBL
Assay Description
Inhibition of TrxR1 in rat liver homogenate preincubated for 5 mins measured by DNTB assay
Bioorg Med Chem 20: 3816-27 (2012)
Article DOI: 10.1016/j.bmc.2012.04.033
BindingDB Entry DOI: 10.7270/Q2V69KND