BDBM50385293 CHEMBL2035470
SMILES: Cc1ccc2[se]n(CCn3[se]c4ccc(C)cc4c3=O)c(=O)c2c1
InChI Key: InChIKey=XTQXKDSAJRFHNT-UHFFFAOYSA-N
Data: 1 IC50
Activity Spreadsheet -- Enzyme Inhibition Constant Data from BindingDB
Found 1 hit for monomerid = 50385293
Trg + Lig
Ki
nM
ΔG°
kcal/mole
IC50
nM
Kd
nM
EC50/IC50
nM
koff
s-1
kon
M-1s-1
pHTemp
°C
Thioredoxin reductase 1, cytoplasmic
(Rattus norvegicus)
BDBM50385293
(CHEMBL2035470)
Show SMILES Cc1ccc2[se]n(CCn3[se]c4ccc(C)cc4c3=O)c(=O)c2c1
Show InChI InChI=1S/C18H16N2O2Se2/c1-11-3-5-15-13(9-11)17(21)19(23-15)7-8-20-18(22)14-10-12(2)4-6-16(14)24-20/h3-6,9-10H,7-8H2,1-2H3
n/an/a 1.26E+3n/an/an/an/an/an/a
Peking University
Curated by ChEMBL
Assay Description
Inhibition of TrxR1 in rat liver homogenate preincubated for 5 mins measured by DNTB assay
Bioorg Med Chem 20: 3816-27 (2012)
Article DOI: 10.1016/j.bmc.2012.04.033
BindingDB Entry DOI: 10.7270/Q2V69KND