BDBM50385402 CHEMBL2036573
SMILES: Fc1ccccc1Nc1nnc(o1)C(=O)Nc1ccc(cc1)N1CCCCC1
InChI Key: InChIKey=HLMJBIMRZWRNII-UHFFFAOYSA-N
Data: 1 IC50
Activity Spreadsheet -- Enzyme Inhibition Constant Data from BindingDB
Found 1 hit for monomerid = 50385402
Trg + Lig
Ki
nM
ΔG°
kcal/mole
IC50
nM
Kd
nM
EC50/IC50
nM
koff
s-1
kon
M-1s-1
pHTemp
°C
Diacylglycerol O-acyltransferase 1 (DGAT1)
(Homo sapiens (Human))
BDBM50385402
(CHEMBL2036573)
Show SMILES Fc1ccccc1Nc1nnc(o1)C(=O)Nc1ccc(cc1)N1CCCCC1
Show InChI InChI=1S/C20H20FN5O2/c21-16-6-2-3-7-17(16)23-20-25-24-19(28-20)18(27)22-14-8-10-15(11-9-14)26-12-4-1-5-13-26/h2-3,6-11H,1,4-5,12-13H2,(H,22,27)(H,23,25)
n/an/a 190n/an/an/an/an/an/a
AstraZeneca
Curated by ChEMBL
Assay Description
Inhibition of human recombinant DGAT1 expressed in baculovirus infected insect sf9 cells using [14C] oleoyl coenzyme A after 30 mins by scintillation...
Bioorg Med Chem Lett 22: 3873-8 (2012)
Article DOI: 10.1016/j.bmcl.2012.04.117
BindingDB Entry DOI: 10.7270/Q2T72JG4