BDBM50385426 CHEMBL2036731
SMILES: O=C(Nc1ccc(nc1)N1CCOCC1)c1nnc(Nc2cccc(OCc3ccccn3)c2)o1
InChI Key: InChIKey=QEFIUPVSZQTCDL-UHFFFAOYSA-N
Data: 1 IC50
Activity Spreadsheet -- Enzyme Inhibition Constant Data from BindingDB
Found 1 hit for monomerid = 50385426
Trg + Lig
Ki
nM
ΔG°
kcal/mole
IC50
nM
Kd
nM
EC50/IC50
nM
koff
s-1
kon
M-1s-1
pHTemp
°C
Diacylglycerol O-acyltransferase 1 (DGAT1)
(Homo sapiens (Human))
BDBM50385426
(CHEMBL2036731)
Show SMILES O=C(Nc1ccc(nc1)N1CCOCC1)c1nnc(Nc2cccc(OCc3ccccn3)c2)o1
Show InChI InChI=1S/C24H23N7O4/c32-22(27-18-7-8-21(26-15-18)31-10-12-33-13-11-31)23-29-30-24(35-23)28-17-5-3-6-20(14-17)34-16-19-4-1-2-9-25-19/h1-9,14-15H,10-13,16H2,(H,27,32)(H,28,30)
n/an/a 540n/an/an/an/an/an/a
AstraZeneca
Curated by ChEMBL
Assay Description
Inhibition of human recombinant DGAT1 expressed in baculovirus infected insect sf9 cells using [14C] oleoyl coenzyme A after 30 mins by scintillation...
Bioorg Med Chem Lett 22: 3873-8 (2012)
Article DOI: 10.1016/j.bmcl.2012.04.117
BindingDB Entry DOI: 10.7270/Q2T72JG4