BDBM50385437 CHEMBL2036743
SMILES: OC(=O)Cc1ccc(cc1)-c1ccc(NC(=O)c2nnc(Nc3ccccc3F)o2)cc1
InChI Key: InChIKey=VJNHSQUDOVDULC-UHFFFAOYSA-N
Data: 1 IC50
Activity Spreadsheet -- Enzyme Inhibition Constant Data from BindingDB
Found 1 hit for monomerid = 50385437
Trg + Lig
Ki
nM
ΔG°
kcal/mole
IC50
nM
Kd
nM
EC50/IC50
nM
koff
s-1
kon
M-1s-1
pHTemp
°C
Diacylglycerol O-acyltransferase 1 (DGAT1)
(Homo sapiens (Human))
BDBM50385437
(CHEMBL2036743)
Show SMILES OC(=O)Cc1ccc(cc1)-c1ccc(NC(=O)c2nnc(Nc3ccccc3F)o2)cc1
Show InChI InChI=1S/C23H17FN4O4/c24-18-3-1-2-4-19(18)26-23-28-27-22(32-23)21(31)25-17-11-9-16(10-12-17)15-7-5-14(6-8-15)13-20(29)30/h1-12H,13H2,(H,25,31)(H,26,28)(H,29,30)
n/an/a 80n/an/an/an/an/an/a
AstraZeneca
Curated by ChEMBL
Assay Description
Inhibition of human recombinant DGAT1 expressed in baculovirus infected insect sf9 cells using [14C] oleoyl coenzyme A after 30 mins by scintillation...
Bioorg Med Chem Lett 22: 3873-8 (2012)
Article DOI: 10.1016/j.bmcl.2012.04.117
BindingDB Entry DOI: 10.7270/Q2T72JG4