BDBM50385501 CHEMBL2040553
SMILES: COc1ccc(cc1)C(=O)CC(=O)C(O)=O
InChI Key: InChIKey=QTDIUFUNHQSHTP-UHFFFAOYSA-N
Data: 1 KI  1 EC50
Activity Spreadsheet -- Enzyme Inhibition Constant Data from BindingDB
Found 2 hits for monomerid = 50385501
Trg + Lig
Ki
nM
ΔG°
kcal/mole
IC50
nM
Kd
nM
EC50/IC50
nM
koff
s-1
kon
M-1s-1
pHTemp
°C
PA/PB1
(Hepatitis C virus)
BDBM50385501
(CHEMBL2040553)
Show SMILES COc1ccc(cc1)C(=O)CC(=O)C(O)=O
Show InChI InChI=1S/C11H10O5/c1-16-8-4-2-7(3-5-8)9(12)6-10(13)11(14)15/h2-5H,6H2,1H3,(H,14,15)
1.97E+3n/an/an/an/an/an/an/an/a
University of Tennessee Health Science Center
Curated by ChEMBL
Assay Description
Binding affinity to PA N-terminal domain (Competitive)
ACS Chem Biol 7: 526-34 (2012)
Article DOI: 10.1021/cb200439z
BindingDB Entry DOI: 10.7270/Q2JQ121G
PA/PB1
(Hepatitis C virus)
BDBM50385501
(CHEMBL2040553)
Show SMILES COc1ccc(cc1)C(=O)CC(=O)C(O)=O
Show InChI InChI=1S/C11H10O5/c1-16-8-4-2-7(3-5-8)9(12)6-10(13)11(14)15/h2-5H,6H2,1H3,(H,14,15)
n/an/an/an/a 6.70E+3n/an/an/an/a
University of Tennessee Health Science Center
Curated by ChEMBL
Assay Description
Plaque growth inhibition
ACS Chem Biol 7: 526-34 (2012)
Article DOI: 10.1021/cb200439z
BindingDB Entry DOI: 10.7270/Q2JQ121G