BDBM50385535 CHEMBL2040606
SMILES: On1c(=O)c(=Cc2ccccc2)[nH]c(=Cc2ccc(F)cc2)c1=O
InChI Key: InChIKey=KTXSVZIYHXYYLC-UHFFFAOYSA-N
Data: 2 IC50
Activity Spreadsheet -- Enzyme Inhibition Constant Data from BindingDB
Found 2 hits for monomerid = 50385535
Trg + Lig
Ki
nM
ΔG°
kcal/mole
IC50
nM
Kd
nM
EC50/IC50
nM
koff
s-1
kon
M-1s-1
pHTemp
°C
PA/PB1
(Hepatitis C virus)
BDBM50385535
(CHEMBL2040606)
Show SMILES On1c(=O)c(=Cc2ccccc2)[nH]c(=Cc2ccc(F)cc2)c1=O |w:5.5,14.15|
Show InChI InChI=1S/C18H13FN2O3/c19-14-8-6-13(7-9-14)11-16-18(23)21(24)17(22)15(20-16)10-12-4-2-1-3-5-12/h1-11,20,24H
n/an/a 3.50E+3n/an/an/an/an/an/a
Shandong University
Curated by ChEMBL
Assay Description
Inhibition of influenza A virus (A/PR/8/34) N-terminal PA endonuclease using 880 nucleotide ALMV cap1 primer RNA as substrate
J Med Chem 60: 3533-3551 (2017)
Article DOI: 10.1021/acs.jmedchem.6b01227
BindingDB Entry DOI: 10.7270/Q2VQ34XH
PA/PB1
(Hepatitis C virus)
BDBM50385535
(CHEMBL2040606)
Show SMILES On1c(=O)c(=Cc2ccccc2)[nH]c(=Cc2ccc(F)cc2)c1=O |w:5.5,14.15|
Show InChI InChI=1S/C18H13FN2O3/c19-14-8-6-13(7-9-14)11-16-18(23)21(24)17(22)15(20-16)10-12-4-2-1-3-5-12/h1-11,20,24H
n/an/a 3.50E+3n/an/an/an/an/an/a
Merck Research Laboratories
Curated by ChEMBL
Assay Description
Inhibition of cap 1 ALMV primed Influenza transcriptase
J Org Chem 66: 5504-16 (2001)
BindingDB Entry DOI: 10.7270/Q298882D