BDBM50385626 CHEMBL2042378
SMILES: CN1C(=O)N(Cc2csc(n2)-c2ccccc2)C(=O)C11C(=O)N(CC(O)=O)c2ccc(Cl)cc12
InChI Key: InChIKey=ASSMTOZUONKVFM-UHFFFAOYSA-N
Data: 1 KI  1 IC50
Activity Spreadsheet -- Enzyme Inhibition Constant Data from BindingDB
Found 2 hits for monomerid = 50385626
Trg + Lig
Ki
nM
ΔG°
kcal/mole
IC50
nM
Kd
nM
EC50/IC50
nM
koff
s-1
kon
M-1s-1
pHTemp
°C
G protein-coupled receptor 44
(Homo sapiens (Human))
BDBM50385626
(CHEMBL2042378)
Show SMILES CN1C(=O)N(Cc2csc(n2)-c2ccccc2)C(=O)C11C(=O)N(CC(O)=O)c2ccc(Cl)cc12
Show InChI InChI=1S/C23H17ClN4O5S/c1-26-22(33)28(10-15-12-34-19(25-15)13-5-3-2-4-6-13)21(32)23(26)16-9-14(24)7-8-17(16)27(20(23)31)11-18(29)30/h2-9,12H,10-11H2,1H3,(H,29,30)
Reactome pathway
16n/an/an/an/an/an/an/an/a
TBA
Curated by ChEMBL
Assay Description
Displacement of [3H]PGD2 from human CRTH2 receptor expressed in CHO cells after 90 mins by scintillation proximity assay
ACS Med Chem Lett 2: 644-649 (2011)
Article DOI: 10.1021/ml2001196
BindingDB Entry DOI: 10.7270/Q28916X5
G protein-coupled receptor 44
(Homo sapiens (Human))
BDBM50385626
(CHEMBL2042378)
Show SMILES CN1C(=O)N(Cc2csc(n2)-c2ccccc2)C(=O)C11C(=O)N(CC(O)=O)c2ccc(Cl)cc12
Show InChI InChI=1S/C23H17ClN4O5S/c1-26-22(33)28(10-15-12-34-19(25-15)13-5-3-2-4-6-13)21(32)23(26)16-9-14(24)7-8-17(16)27(20(23)31)11-18(29)30/h2-9,12H,10-11H2,1H3,(H,29,30)
Reactome pathway
n/an/a 3.94E+3n/an/an/an/an/an/a
TBA
Curated by ChEMBL
Assay Description
Antagonist activity at CRTH2 receptor in human whole blood assessed as inhibition of PGD2-induced eosinophil shape change pretreated for 20 mins meas...
ACS Med Chem Lett 2: 644-649 (2011)
Article DOI: 10.1021/ml2001196
BindingDB Entry DOI: 10.7270/Q28916X5