BDBM50385648 CHEMBL2041957
SMILES: Fc1ccc(cc1)-c1c(oc2ccccc2c1=O)-c1ccnc(Cl)c1
InChI Key: InChIKey=BYBFWIAMPFYHEX-UHFFFAOYSA-N
Data: 1 IC50
Activity Spreadsheet -- Enzyme Inhibition Constant Data from BindingDB
Found 1 hit for monomerid = 50385648
Trg + Lig
Ki
nM
ΔG°
kcal/mole
IC50
nM
Kd
nM
EC50/IC50
nM
koff
s-1
kon
M-1s-1
pHTemp
°C
Mitogen-activated protein kinase 14
(Homo sapiens (Human))
BDBM50385648
(CHEMBL2041957)
Show SMILES Fc1ccc(cc1)-c1c(oc2ccccc2c1=O)-c1ccnc(Cl)c1
Show InChI InChI=1S/C20H11ClFNO2/c21-17-11-13(9-10-23-17)20-18(12-5-7-14(22)8-6-12)19(24)15-3-1-2-4-16(15)25-20/h1-11H
NCI pathway
Reactome pathway
n/an/a 1.38E+3n/an/an/an/an/an/a
University of Gothenburg
Curated by ChEMBL
Assay Description
Inhibition of p38alpha MAPK after 40 mins by scintillation counting
J Med Chem 54: 7427-31 (2011)
Article DOI: 10.1021/jm200818j
BindingDB Entry DOI: 10.7270/Q2R78G7T