BDBM50385909 CHEMBL2041586
SMILES: CCOc1cc(cc(OCC)c1OCC)C(=O)OCc1ccc(o1)-c1ccc(cc1C)[N+]([O-])=O
InChI Key: InChIKey=KFSRDXAZIINLJH-UHFFFAOYSA-N
Data: 1 IC50
Activity Spreadsheet -- Enzyme Inhibition Constant Data from BindingDB
Found 1 hit for monomerid = 50385909
Trg + Lig
Ki
nM
ΔG°
kcal/mole
IC50
nM
Kd
nM
EC50/IC50
nM
koff
s-1
kon
M-1s-1
pHTemp
°C
Phosphodiesterase 7
(Homo sapiens (Human))
BDBM50385909
(CHEMBL2041586)
Show SMILES CCOc1cc(cc(OCC)c1OCC)C(=O)OCc1ccc(o1)-c1ccc(cc1C)[N+]([O-])=O
Show InChI InChI=1S/C25H27NO8/c1-5-30-22-13-17(14-23(31-6-2)24(22)32-7-3)25(27)33-15-19-9-11-21(34-19)20-10-8-18(26(28)29)12-16(20)4/h8-14H,5-7,15H2,1-4H3
Reactome pathway
n/an/a 580n/an/an/an/an/an/a
Instituto de Qu£mica M£dica (CSIC)
Curated by ChEMBL
Assay Description
Inhibition of PDE7A1
J Med Chem 55: 3274-84 (2012)
Article DOI: 10.1021/jm201720d
BindingDB Entry DOI: 10.7270/Q2ZS2XJB