null
SMILES: COc1ccc(CN(C)C(=O)c2cc3c(Cc4cccc(C)c4)n[nH]c3cc2O)cc1OC
InChI Key: InChIKey=WNCCXPHAUXYECH-UHFFFAOYSA-N
Activity Spreadsheet -- Enzyme Inhibition Constant Data from BindingDB
Found 1 hit for monomerid = 50386049
Trg + Lig
Ki
nM
ΔG°
kcal/mole
IC50
nM
Kd
nM
EC50/IC50
nM
koff
s-1
kon
M-1s-1
pHTemp
°C
Heat shock protein HSP 90-beta
(Homo sapiens (Human))
BDBM50386049
(CHEMBL2040870)
Show SMILES COc1ccc(CN(C)C(=O)c2cc3c(Cc4cccc(C)c4)n[nH]c3cc2O)cc1OC
Show InChI InChI=1S/C26H27N3O4/c1-16-6-5-7-17(10-16)11-21-19-13-20(23(30)14-22(19)28-27-21)26(31)29(2)15-18-8-9-24(32-3)25(12-18)33-4/h5-10,12-14,30H,11,15H2,1-4H3,(H,27,28)
Reactome pathway
n/an/a 580n/an/an/an/an/an/a
Merck Serono Research
Curated by ChEMBL
Assay Description
Displacement of [3H]17AAG from human recombinant Hsp90 after 30 mins by beta scintillation counting
Bioorg Med Chem Lett 22: 4396-403 (2012)
Article DOI: 10.1016/j.bmcl.2012.04.121
BindingDB Entry DOI: 10.7270/Q2T154QC