BDBM50386325 CHEMBL2048402
SMILES: NS(=O)(=O)c1cccc(C[C@H](NC(=O)c2c(Cl)cc3CN(CCc3c2Cl)C(=O)c2ccc3ccoc3c2)C(O)=O)c1
InChI Key: InChIKey=XYTRSSKMVCVZQA-QFIPXVFZSA-N
Data: 2 IC50
Activity Spreadsheet -- Enzyme Inhibition Constant Data from BindingDB
Found 2 hits for monomerid = 50386325
Trg + Lig
Ki
nM
ΔG°
kcal/mole
IC50
nM
Kd
nM
EC50/IC50
nM
koff
s-1
kon
M-1s-1
pHTemp
°C
Integrin beta-2/Intercellular adhesion molecule-1 /Leukocyte adhesion glycoprotein LFA-1 alpha
(Homo sapiens (Human))
BDBM50386325
(CHEMBL2048402)
Show SMILES NS(=O)(=O)c1cccc(C[C@H](NC(=O)c2c(Cl)cc3CN(CCc3c2Cl)C(=O)c2ccc3ccoc3c2)C(O)=O)c1 |r|
Show InChI InChI=1S/C28H23Cl2N3O7S/c29-21-12-18-14-33(27(35)17-5-4-16-7-9-40-23(16)13-17)8-6-20(18)25(30)24(21)26(34)32-22(28(36)37)11-15-2-1-3-19(10-15)41(31,38)39/h1-5,7,9-10,12-13,22H,6,8,11,14H2,(H,32,34)(H,36,37)(H2,31,38,39)/t22-/m0/s1
n/an/a 4n/an/an/an/an/an/a
TBA
Curated by ChEMBL
Assay Description
Antagonist activity at LFA-1/ICAM-1 in human HuT-78 T-cells assessed as inhibition of cell adhesion after 1 hr by p-nitrophenyl n-acetyl-beta-D-gluco...
ACS Med Chem Lett 3: 203-206 (2012)
Article DOI: 10.1021/ml2002482
BindingDB Entry DOI: 10.7270/Q2BV7HP5
Integrin beta-2/Intercellular adhesion molecule-1 /Leukocyte adhesion glycoprotein LFA-1 alpha
(Homo sapiens (Human))
BDBM50386325
(CHEMBL2048402)
Show SMILES NS(=O)(=O)c1cccc(C[C@H](NC(=O)c2c(Cl)cc3CN(CCc3c2Cl)C(=O)c2ccc3ccoc3c2)C(O)=O)c1 |r|
Show InChI InChI=1S/C28H23Cl2N3O7S/c29-21-12-18-14-33(27(35)17-5-4-16-7-9-40-23(16)13-17)8-6-20(18)25(30)24(21)26(34)32-22(28(36)37)11-15-2-1-3-19(10-15)41(31,38)39/h1-5,7,9-10,12-13,22H,6,8,11,14H2,(H,32,34)(H,36,37)(H2,31,38,39)/t22-/m0/s1
n/an/a 200n/an/an/an/an/an/a
TBA
Curated by ChEMBL
Assay Description
Antagonist activity at LFA-1/ICAM-1 in human HuT-78 T-cells assessed as inhibition of cell adhesion after 1 hr by p-nitrophenyl n-acetyl-beta-D-gluco...
ACS Med Chem Lett 3: 203-206 (2012)
Article DOI: 10.1021/ml2002482
BindingDB Entry DOI: 10.7270/Q2BV7HP5