BDBM50386327 CHEMBL2048023
SMILES: CC(C)c1cccc(C[C@H](NC(=O)c2c(Cl)cc3CN(CCc3c2Cl)C(=O)c2ccc(Cl)cc2)C(O)=O)c1
InChI Key: InChIKey=ZFUSMHKFXKIZTH-DEOSSOPVSA-N
Data: 2 IC50
Activity Spreadsheet -- Enzyme Inhibition Constant Data from BindingDB
Found 2 hits for monomerid = 50386327
Trg + Lig
Ki
nM
ΔG°
kcal/mole
IC50
nM
Kd
nM
EC50/IC50
nM
koff
s-1
kon
M-1s-1
pHTemp
°C
Integrin beta-2/Intercellular adhesion molecule-1 /Leukocyte adhesion glycoprotein LFA-1 alpha
(Homo sapiens (Human))
BDBM50386327
(CHEMBL2048023)
Show SMILES CC(C)c1cccc(C[C@H](NC(=O)c2c(Cl)cc3CN(CCc3c2Cl)C(=O)c2ccc(Cl)cc2)C(O)=O)c1 |r|
Show InChI InChI=1S/C29H27Cl3N2O4/c1-16(2)19-5-3-4-17(12-19)13-24(29(37)38)33-27(35)25-23(31)14-20-15-34(11-10-22(20)26(25)32)28(36)18-6-8-21(30)9-7-18/h3-9,12,14,16,24H,10-11,13,15H2,1-2H3,(H,33,35)(H,37,38)/t24-/m0/s1
n/an/a>1.00E+4n/an/an/an/an/an/a
TBA
Curated by ChEMBL
Assay Description
Antagonist activity at LFA-1/ICAM-1 in human HuT-78 T-cells assessed as inhibition of cell adhesion after 1 hr by p-nitrophenyl n-acetyl-beta-D-gluco...
ACS Med Chem Lett 3: 203-206 (2012)
Article DOI: 10.1021/ml2002482
BindingDB Entry DOI: 10.7270/Q2BV7HP5
Integrin beta-2/Intercellular adhesion molecule-1 /Leukocyte adhesion glycoprotein LFA-1 alpha
(Homo sapiens (Human))
BDBM50386327
(CHEMBL2048023)
Show SMILES CC(C)c1cccc(C[C@H](NC(=O)c2c(Cl)cc3CN(CCc3c2Cl)C(=O)c2ccc(Cl)cc2)C(O)=O)c1 |r|
Show InChI InChI=1S/C29H27Cl3N2O4/c1-16(2)19-5-3-4-17(12-19)13-24(29(37)38)33-27(35)25-23(31)14-20-15-34(11-10-22(20)26(25)32)28(36)18-6-8-21(30)9-7-18/h3-9,12,14,16,24H,10-11,13,15H2,1-2H3,(H,33,35)(H,37,38)/t24-/m0/s1
n/an/a 10n/an/an/an/an/an/a
TBA
Curated by ChEMBL
Assay Description
Antagonist activity at LFA-1/ICAM-1 in human HuT-78 T-cells assessed as inhibition of cell adhesion after 1 hr by p-nitrophenyl n-acetyl-beta-D-gluco...
ACS Med Chem Lett 3: 203-206 (2012)
Article DOI: 10.1021/ml2002482
BindingDB Entry DOI: 10.7270/Q2BV7HP5