BDBM50386342 CHEMBL2048405
SMILES: CP(C)(=O)c1cccc(C[C@H](NC(=O)c2c(Cl)cc3CN(CCc3c2Cl)C(=O)c2ccc3ccoc3c2)C(O)=O)c1
InChI Key: InChIKey=QPZCYDCQRGXZLP-DEOSSOPVSA-N
Data: 2 IC50
Activity Spreadsheet -- Enzyme Inhibition Constant Data from BindingDB
Found 2 hits for monomerid = 50386342
Trg + Lig
Ki
nM
ΔG°
kcal/mole
IC50
nM
Kd
nM
EC50/IC50
nM
koff
s-1
kon
M-1s-1
pHTemp
°C
Integrin beta-2/Intercellular adhesion molecule-1 /Leukocyte adhesion glycoprotein LFA-1 alpha
(Homo sapiens (Human))
BDBM50386342
(CHEMBL2048405)
Show SMILES CP(C)(=O)c1cccc(C[C@H](NC(=O)c2c(Cl)cc3CN(CCc3c2Cl)C(=O)c2ccc3ccoc3c2)C(O)=O)c1 |r|
Show InChI InChI=1S/C30H27Cl2N2O6P/c1-41(2,39)21-5-3-4-17(12-21)13-24(30(37)38)33-28(35)26-23(31)14-20-16-34(10-8-22(20)27(26)32)29(36)19-7-6-18-9-11-40-25(18)15-19/h3-7,9,11-12,14-15,24H,8,10,13,16H2,1-2H3,(H,33,35)(H,37,38)/t24-/m0/s1
n/an/a 490n/an/an/an/an/an/a
TBA
Curated by ChEMBL
Assay Description
Antagonist activity at LFA-1/ICAM-1 in human HuT-78 T-cells assessed as inhibition of cell adhesion after 1 hr by p-nitrophenyl n-acetyl-beta-D-gluco...
ACS Med Chem Lett 3: 203-206 (2012)
Article DOI: 10.1021/ml2002482
BindingDB Entry DOI: 10.7270/Q2BV7HP5
Integrin beta-2/Intercellular adhesion molecule-1 /Leukocyte adhesion glycoprotein LFA-1 alpha
(Homo sapiens (Human))
BDBM50386342
(CHEMBL2048405)
Show SMILES CP(C)(=O)c1cccc(C[C@H](NC(=O)c2c(Cl)cc3CN(CCc3c2Cl)C(=O)c2ccc3ccoc3c2)C(O)=O)c1 |r|
Show InChI InChI=1S/C30H27Cl2N2O6P/c1-41(2,39)21-5-3-4-17(12-21)13-24(30(37)38)33-28(35)26-23(31)14-20-16-34(10-8-22(20)27(26)32)29(36)19-7-6-18-9-11-40-25(18)15-19/h3-7,9,11-12,14-15,24H,8,10,13,16H2,1-2H3,(H,33,35)(H,37,38)/t24-/m0/s1
n/an/a 58n/an/an/an/an/an/a
TBA
Curated by ChEMBL
Assay Description
Antagonist activity at LFA-1/ICAM-1 in human HuT-78 T-cells assessed as inhibition of cell adhesion after 1 hr by p-nitrophenyl n-acetyl-beta-D-gluco...
ACS Med Chem Lett 3: 203-206 (2012)
Article DOI: 10.1021/ml2002482
BindingDB Entry DOI: 10.7270/Q2BV7HP5