BDBM50386417 CHEMBL2047315
SMILES: COc1ccc2ccc(cc2c1)S(=O)(=O)N(C)[C@H]1CCN(Cc2ccc(s2)C(N)=N)C1=O
InChI Key: InChIKey=OGMALKMSTCZRBZ-IBGZPJMESA-N
Data: 1 IC50
Activity Spreadsheet -- Enzyme Inhibition Constant Data from BindingDB
Found 1 hit for monomerid = 50386417
Trg + Lig
Ki
nM
ΔG°
kcal/mole
IC50
nM
Kd
nM
EC50/IC50
nM
koff
s-1
kon
M-1s-1
pHTemp
°C
Kallikrein 6
(Homo sapiens (Human))
BDBM50386417
(CHEMBL2047315)
Show SMILES COc1ccc2ccc(cc2c1)S(=O)(=O)N(C)[C@H]1CCN(Cc2ccc(s2)C(N)=N)C1=O |r|
Show InChI InChI=1S/C22H24N4O4S2/c1-25(19-9-10-26(22(19)27)13-17-6-8-20(31-17)21(23)24)32(28,29)18-7-4-14-3-5-16(30-2)11-15(14)12-18/h3-8,11-12,19H,9-10,13H2,1-2H3,(H3,23,24)/t19-/m0/s1
NCI pathway
n/an/a 8.20E+3n/an/an/an/an/an/a
TBA
Curated by ChEMBL
Assay Description
Inhibition of N-terminus His6-tagged human kallikrein 6 expressed in baculovirus infected insect sf9 cells using Boc-Phe-Ser-Arg-AMC as substrate by ...
ACS Med Chem Lett 3: 159-164 (2012)
Article DOI: 10.1021/ml200291e
BindingDB Entry DOI: 10.7270/Q2FN177M