BDBM50386438 CHEMBL2047689
SMILES: Fc1ccc(CC(N=O)C(=O)NCCS)cc1
InChI Key: InChIKey=XLGZILTYAMAFIV-UHFFFAOYSA-N
Data: 2 IC50
Activity Spreadsheet -- Enzyme Inhibition Constant Data from BindingDB
Found 2 hits for monomerid = 50386438
Trg + Lig
Ki
nM
ΔG°
kcal/mole
IC50
nM
Kd
nM
EC50/IC50
nM
koff
s-1
kon
M-1s-1
pHTemp
°C
Histone deacetylase 6
(Homo sapiens (Human))
BDBM50386438
(CHEMBL2047689)
Show SMILES Fc1ccc(CC(N=O)C(=O)NCCS)cc1
Show InChI InChI=1S/C11H13FN2O2S/c12-9-3-1-8(2-4-9)7-10(14-16)11(15)13-5-6-17/h1-4,10,17H,5-7H2,(H,13,15)
NCI pathway
Reactome pathway
n/an/a 2.90E+3n/an/an/an/an/an/a
Imperial College London
Curated by ChEMBL
Assay Description
Inhibition of human recombinant HDAC6 using Boc-lys(Ac)-AMC as substrate preincubated for 20 mins with substrate measured after 60 mins by fluorescen...
J Med Chem 55: 1731-50 (2012)
Article DOI: 10.1021/jm2016182
BindingDB Entry DOI: 10.7270/Q22F7PHC
Histone deacetylase 1
(Homo sapiens (Human))
BDBM50386438
(CHEMBL2047689)
Show SMILES Fc1ccc(CC(N=O)C(=O)NCCS)cc1
Show InChI InChI=1S/C11H13FN2O2S/c12-9-3-1-8(2-4-9)7-10(14-16)11(15)13-5-6-17/h1-4,10,17H,5-7H2,(H,13,15)
NCI pathway
Reactome pathway
n/an/a 7n/an/an/an/an/an/a
Imperial College London
Curated by ChEMBL
Assay Description
Inhibition of human recombinant HDAC1 using Boc-lys(Ac)-AMC as substrate preincubated for 20 mins with substrate measured after 60 mins by fluorescen...
J Med Chem 55: 1731-50 (2012)
Article DOI: 10.1021/jm2016182
BindingDB Entry DOI: 10.7270/Q22F7PHC