null
SMILES: [O-][N+](=O)c1cc(Br)cc(CC(N=O)C(=O)NCCS)c1
InChI Key: InChIKey=CGDLMPPQJOPZRH-UHFFFAOYSA-N
Activity Spreadsheet -- Enzyme Inhibition Constant Data from BindingDB
Found 2 hits for monomerid = 50386446
Trg + Lig
Ki
nM
ΔG°
kcal/mole
IC50
nM
Kd
nM
EC50/IC50
nM
koff
s-1
kon
M-1s-1
pHTemp
°C
Histone deacetylase 6
(Homo sapiens (Human))
BDBM50386446
(CHEMBL2047700)
Show SMILES [O-][N+](=O)c1cc(Br)cc(CC(N=O)C(=O)NCCS)c1
Show InChI InChI=1S/C11H12BrN3O4S/c12-8-3-7(4-9(6-8)15(18)19)5-10(14-17)11(16)13-1-2-20/h3-4,6,10,20H,1-2,5H2,(H,13,16)
NCI pathway
Reactome pathway
n/an/a 740n/an/an/an/an/an/a
Imperial College London
Curated by ChEMBL
Assay Description
Inhibition of human recombinant HDAC6 using Boc-lys(Ac)-AMC as substrate preincubated for 20 mins with substrate measured after 60 mins by fluorescen...
J Med Chem 55: 1731-50 (2012)
Article DOI: 10.1021/jm2016182
BindingDB Entry DOI: 10.7270/Q22F7PHC
Histone deacetylase 1
(Homo sapiens (Human))
BDBM50386446
(CHEMBL2047700)
Show SMILES [O-][N+](=O)c1cc(Br)cc(CC(N=O)C(=O)NCCS)c1
Show InChI InChI=1S/C11H12BrN3O4S/c12-8-3-7(4-9(6-8)15(18)19)5-10(14-17)11(16)13-1-2-20/h3-4,6,10,20H,1-2,5H2,(H,13,16)
NCI pathway
Reactome pathway
n/an/a 5n/an/an/an/an/an/a
Imperial College London
Curated by ChEMBL
Assay Description
Inhibition of human recombinant HDAC1 using Boc-lys(Ac)-AMC as substrate preincubated for 20 mins with substrate measured after 60 mins by fluorescen...
J Med Chem 55: 1731-50 (2012)
Article DOI: 10.1021/jm2016182
BindingDB Entry DOI: 10.7270/Q22F7PHC