BDBM50386527 CHEMBL2047891
SMILES: CC(F)(F)c1cccc(CN[C@H]2CS(=O)(=O)C[C@@H](Cc3cc(F)c(N)c(Br)c3)[C@@H]2O)c1
InChI Key: InChIKey=QBRKIXCNLLQOPH-WNYOCNMUSA-N
Data: 3 IC50
PDB links: 1 PDB ID matches this monomer.
Activity Spreadsheet -- Enzyme Inhibition Constant Data from BindingDB
Found 3 hits for monomerid = 50386527
Trg + Lig
Ki
nM
ΔG°
kcal/mole
IC50
nM
Kd
nM
EC50/IC50
nM
koff
s-1
kon
M-1s-1
pHTemp
°C
Beta-secretase 1
(Homo sapiens (Human))
BDBM50386527
(CHEMBL2047891)
Show SMILES CC(F)(F)c1cccc(CN[C@H]2CS(=O)(=O)C[C@@H](Cc3cc(F)c(N)c(Br)c3)[C@@H]2O)c1 |r|
Show InChI InChI=1S/C21H24BrF3N2O3S/c1-21(24,25)15-4-2-3-12(6-15)9-27-18-11-31(29,30)10-14(20(18)28)5-13-7-16(22)19(26)17(23)8-13/h2-4,6-8,14,18,20,27-28H,5,9-11,26H2,1H3/t14-,18+,20+/m1/s1
n/an/a 4.98E+3n/an/an/an/an/an/a
Novartis Pharma AG
Curated by ChEMBL
Assay Description
Inhibition of BACE-1 mediated amyloid beta 40 release in human wild type APP-transfected CHO cells by HTRF immunoassay
J Med Chem 55: 3364-86 (2012)
Article DOI: 10.1021/jm300069y
BindingDB Entry DOI: 10.7270/Q2P55PJW
3D
3D Structure (crystal)
Cathepsin D
(Homo sapiens (Human))
BDBM50386527
(CHEMBL2047891)
Show SMILES CC(F)(F)c1cccc(CN[C@H]2CS(=O)(=O)C[C@@H](Cc3cc(F)c(N)c(Br)c3)[C@@H]2O)c1 |r|
Show InChI InChI=1S/C21H24BrF3N2O3S/c1-21(24,25)15-4-2-3-12(6-15)9-27-18-11-31(29,30)10-14(20(18)28)5-13-7-16(22)19(26)17(23)8-13/h2-4,6-8,14,18,20,27-28H,5,9-11,26H2,1H3/t14-,18+,20+/m1/s1
NCI pathway
Reactome pathway
n/an/a 4.16E+3n/an/an/an/an/an/a
Novartis Pharma AG
Curated by ChEMBL
Assay Description
Inhibition of human recombinant CatD using Mca-GKPILFFRLK(DNP)-dR-NH2 as substrate after 1 hr by fluorescence analysis
J Med Chem 55: 3364-86 (2012)
Article DOI: 10.1021/jm300069y
BindingDB Entry DOI: 10.7270/Q2P55PJW
Beta-secretase 1
(Homo sapiens (Human))
BDBM50386527
(CHEMBL2047891)
Show SMILES CC(F)(F)c1cccc(CN[C@H]2CS(=O)(=O)C[C@@H](Cc3cc(F)c(N)c(Br)c3)[C@@H]2O)c1 |r|
Show InChI InChI=1S/C21H24BrF3N2O3S/c1-21(24,25)15-4-2-3-12(6-15)9-27-18-11-31(29,30)10-14(20(18)28)5-13-7-16(22)19(26)17(23)8-13/h2-4,6-8,14,18,20,27-28H,5,9-11,26H2,1H3/t14-,18+,20+/m1/s1
n/an/a 1.37E+3n/an/an/an/an/an/a
Novartis Pharma AG
Curated by ChEMBL
Assay Description
Inhibition of human recombinant BACE1 ectodomain after 1 hr by fluorescence analysis
J Med Chem 55: 3364-86 (2012)
Article DOI: 10.1021/jm300069y
BindingDB Entry DOI: 10.7270/Q2P55PJW
3D
3D Structure (crystal)