BDBM50386592 CHEMBL2048251
SMILES: Clc1cncc(Cl)c1NNC(=O)CCc1ccccc1
InChI Key: InChIKey=SPGTWQAWMJWXDP-UHFFFAOYSA-N
Data: 2 IC50
Activity Spreadsheet -- Enzyme Inhibition Constant Data from BindingDB
Found 2 hits for monomerid = 50386592
Trg + Lig
Ki
nM
ΔG°
kcal/mole
IC50
nM
Kd
nM
EC50/IC50
nM
koff
s-1
kon
M-1s-1
pHTemp
°C
P2X purinoceptor 7
(Homo sapiens (Human))
BDBM50386592
(CHEMBL2048251)
Show SMILES Clc1cncc(Cl)c1NNC(=O)CCc1ccccc1
Show InChI InChI=1S/C14H13Cl2N3O/c15-11-8-17-9-12(16)14(11)19-18-13(20)7-6-10-4-2-1-3-5-10/h1-5,8-9H,6-7H2,(H,17,19)(H,18,20)
n/an/a 650n/an/an/an/an/an/a
Gwangju Institute of Science and Technology (GIST)
Curated by ChEMBL
Assay Description
Antagonist activity at human P2X7 receptor expressed in HEK293 cells assessed as inhibition of BzATP-induced ethidium bromide uptake after 2 hrs by f...
J Med Chem 55: 3687-98 (2012)
Article DOI: 10.1021/jm2012326
BindingDB Entry DOI: 10.7270/Q21G0NB3
P2X purinoceptor 7
(Homo sapiens (Human))
BDBM50386592
(CHEMBL2048251)
Show SMILES Clc1cncc(Cl)c1NNC(=O)CCc1ccccc1
Show InChI InChI=1S/C14H13Cl2N3O/c15-11-8-17-9-12(16)14(11)19-18-13(20)7-6-10-4-2-1-3-5-10/h1-5,8-9H,6-7H2,(H,17,19)(H,18,20)
n/an/a 320n/an/an/an/an/an/a
Gwangju Institute of Science and Technology (GIST)
Curated by ChEMBL
Assay Description
Antagonist activity at human P2X7 receptor in human THP1 cells assessed as inhibition of BzATP-induced IL8 release pretreated for 30 mins before bzAT...
J Med Chem 55: 3687-98 (2012)
Article DOI: 10.1021/jm2012326
BindingDB Entry DOI: 10.7270/Q21G0NB3