BDBM50386697 CHEMBL2048910
SMILES: CC(C)(C)C(=O)NCCn1ccc2ncnc(Nc3ccc(Oc4cccc5sncc45)c(Cl)c3)c12
InChI Key: InChIKey=JDRIEMWAOXMCLE-UHFFFAOYSA-N
Data: 2 IC50
Activity Spreadsheet -- Enzyme Inhibition Constant Data from BindingDB
Found 2 hits for monomerid = 50386697
Trg + Lig
Ki
nM
ΔG°
kcal/mole
IC50
nM
Kd
nM
EC50/IC50
nM
koff
s-1
kon
M-1s-1
pHTemp
°C
Receptor tyrosine-protein kinase erbB-2
(Homo sapiens (Human))
BDBM50386697
(CHEMBL2048910)
Show SMILES CC(C)(C)C(=O)NCCn1ccc2ncnc(Nc3ccc(Oc4cccc5sncc45)c(Cl)c3)c12
Show InChI InChI=1S/C26H25ClN6O2S/c1-26(2,3)25(34)28-10-12-33-11-9-19-23(33)24(30-15-29-19)32-16-7-8-21(18(27)13-16)35-20-5-4-6-22-17(20)14-31-36-22/h4-9,11,13-15H,10,12H2,1-3H3,(H,28,34)(H,29,30,32)
n/an/a 6.10n/an/an/an/an/an/a
Takeda Pharmaceutical Company Limited
Curated by ChEMBL
Assay Description
Inhibition of N-terminus peptide-tagged human recombinant HER2 expressed using baculovirus infection system using [gamma-33P]-ATP preincubated with c...
J Med Chem 55: 3975-91 (2012)
Article DOI: 10.1021/jm300185p
BindingDB Entry DOI: 10.7270/Q2474BX1
Epidermal growth factor receptor
(Homo sapiens (Human))
BDBM50386697
(CHEMBL2048910)
Show SMILES CC(C)(C)C(=O)NCCn1ccc2ncnc(Nc3ccc(Oc4cccc5sncc45)c(Cl)c3)c12
Show InChI InChI=1S/C26H25ClN6O2S/c1-26(2,3)25(34)28-10-12-33-11-9-19-23(33)24(30-15-29-19)32-16-7-8-21(18(27)13-16)35-20-5-4-6-22-17(20)14-31-36-22/h4-9,11,13-15H,10,12H2,1-3H3,(H,28,34)(H,29,30,32)
n/an/a 21n/an/an/an/an/an/a
Takeda Pharmaceutical Company Limited
Curated by ChEMBL
Assay Description
Inhibition of N-terminus peptide-tagged human recombinant EGFR expressed using baculovirus infection system using [gamma-33P]-ATP preincubated with c...
J Med Chem 55: 3975-91 (2012)
Article DOI: 10.1021/jm300185p
BindingDB Entry DOI: 10.7270/Q2474BX1